24361911 Upgrade Firefox to version 45.4.0 ESR
authorPetr Sumbera <petr.sumbera@oracle.com>
Thu, 22 Sep 2016 04:08:19 -0700
changeset 6975 4f8ca1465013
parent 6974 a7e17efd39b5
child 6976 f62b30352410
24361911 Upgrade Firefox to version 45.4.0 ESR 24708365 problem in FIREFOX/BROWSER
components/desktop/firefox/Makefile
components/desktop/firefox/test/results-i386.master
components/desktop/firefox/test/results-sparc.master
--- a/components/desktop/firefox/Makefile	Mon Sep 26 10:05:24 2016 -0700
+++ b/components/desktop/firefox/Makefile	Thu Sep 22 04:08:19 2016 -0700
@@ -34,20 +34,20 @@
 GCC_ROOT = /usr/gcc/4.9
 
 COMPONENT_NAME =		firefox
-COMPONENT_VERSION =		45.1.1esr
+COMPONENT_VERSION =		45.4.0esr
 COMPONENT_PROJECT_URL =		http://www.mozilla.com/firefox
 COMPONENT_SRC_NAME =		$(COMPONENT_NAME)-$(COMPONENT_VERSION)
 COMPONENT_SRC = 		$(COMPONENT_SRC_NAME)
 COMPONENT_ARCHIVE =		$(COMPONENT_SRC_NAME).source.tar.xz
 COMPONENT_ARCHIVE_HASH = \
-    sha256:a27e36aa1ccebddfe5a113f7f15b09a61e35644be58029b00b0d996a00d04562
+    sha256:cfd90096b9e1019b9de4fe061ece8c65f668b8a24bcbb657ce6b3c940ef83ad0
 MOZILLA_FTP = 		        http://ftp.mozilla.org/pub/mozilla.org/$(COMPONENT_NAME)/releases/$(COMPONENT_VERSION)
 COMPONENT_ARCHIVE_URL =		$(MOZILLA_FTP)/source/$(COMPONENT_ARCHIVE)
 COMPONENT_BUGDB =		firefox/browser
 
-TPNO=				28419	
+TPNO=				31455
 
-IPS_COMPONENT_VERSION =		45.1.1
+IPS_COMPONENT_VERSION =		45.4.0
 
 # There are a set of .xpi files (as given in the LANG_LIST definition below)
 # that we need. These are available under:
@@ -58,8 +58,8 @@
 # collide due to different files with identical .xpi names.
 COMPONENT_ARCHIVE_1 =           $(COMPONENT_SRC_NAME)-xpi.tar.gz
 COMPONENT_ARCHIVE_HASH_1 = \
-	sha256:d80142e7b64b3b61baaf7631e6ad0bf7c4a44d962dc3611bf6dba2dde33aacea
-COMPONENT_ARCHIVE_URL_1 =       $(INTERNAL_ARCHIVE_MIRROR)/source-archives/$(COMPONENT_ARCHIVE_1)
+	sha256:7a1cfadd2bdc81c7e4ecfdf138ec565a8baf7fbb087491db201e0c4fe8994299
+COMPONENT_ARCHIVE_URL_1 =       $(INTERNAL_ARCHIVE_MIRROR)/$(COMPONENT_ARCHIVE_1)
 
 LANG_LIST = ar be bg ca cs da de el es-AR es-CL es-ES et fi \
 	fr he hi-IN hr hu id is it ja kk ko lt lv mk nb-NO nl nn-NO \
@@ -188,8 +188,9 @@
         $(COMPONENT_TEST_RESULTS_DIR)/results-$(MACH).master
 COMPONENT_TEST_DIR =    $(@D)/js/src
 COMPONENT_TEST_TARGETS=check-jit-test
-COMPONENT_TEST_TRANSFORMS += \
-        '-e "/\(^TEST-PASS\).*/d" '
+COMPONENT_TEST_TRANSFORMS = \
+	'-e "/^TIMEOUTS:/,/Failed:/p" ' \
+	'-e "/.*/d" '
 
 REQUIRED_PACKAGES += codec/libogg
 REQUIRED_PACKAGES += codec/libvorbis
--- a/components/desktop/firefox/test/results-i386.master	Mon Sep 26 10:05:24 2016 -0700
+++ b/components/desktop/firefox/test/results-i386.master	Thu Sep 22 04:08:19 2016 -0700
@@ -1,97 +1,4 @@
-make[1]: Entering directory '$(@D)/js/src'
-../../dist/bin/run-mozilla.sh $(@D)/_virtualenv/bin/python -u $(SOURCE_DIR)/js/src/jit-test/jit_test.py \
-        --no-slow --no-progress --format=automation --jitflags=all -j 2 -f \
-		 \
-		 \
-        ../../dist/bin/js 
-$(SOURCE_DIR)/js/src/jit-test/tests/ctypes/conversion-native-function.js:15:14 Error: couldn't find function symbol in library
-Stack:
-  [email protected]$(SOURCE_DIR)/js/src/jit-test/tests/ctypes/conversion-native-function.js:15:14
-  @$(SOURCE_DIR)/js/src/jit-test/tests/ctypes/conversion-native-function.js:37:3
-Exit code: 3
-FAIL - ctypes/conversion-native-function.js
-TEST-UNEXPECTED-FAIL | js/src/jit-test/tests/ctypes/conversion-native-function.js | $(SOURCE_DIR)/js/src/jit-test/tests/ctypes/conversion-native-function.js:15:14 Error: couldn't find function symbol in library (code 3, args "")
-INFO exit-status     : 3
-INFO timed-out       : False
-INFO stderr         2> $(SOURCE_DIR)/js/src/jit-test/tests/ctypes/conversion-native-function.js:15:14 Error: couldn't find function symbol in library
-INFO stderr         2> Stack:
-INFO stderr         2> [email protected]$(SOURCE_DIR)/js/src/jit-test/tests/ctypes/conversion-native-function.js:15:14
-INFO stderr         2> @$(SOURCE_DIR)/js/src/jit-test/tests/ctypes/conversion-native-function.js:37:3
-$(SOURCE_DIR)/js/src/jit-test/tests/ctypes/conversion-native-function.js:15:14 Error: couldn't find function symbol in library
-Stack:
-  [email protected]$(SOURCE_DIR)/js/src/jit-test/tests/ctypes/conversion-native-function.js:15:14
-  @$(SOURCE_DIR)/js/src/jit-test/tests/ctypes/conversion-native-function.js:37:3
-Exit code: 3
-FAIL - ctypes/conversion-native-function.js
-TEST-UNEXPECTED-FAIL | js/src/jit-test/tests/ctypes/conversion-native-function.js | $(SOURCE_DIR)/js/src/jit-test/tests/ctypes/conversion-native-function.js:15:14 Error: couldn't find function symbol in library (code 3, args "--ion-eager --ion-offthread-compile=off")
-INFO exit-status     : 3
-INFO timed-out       : False
-INFO stderr         2> $(SOURCE_DIR)/js/src/jit-test/tests/ctypes/conversion-native-function.js:15:14 Error: couldn't find function symbol in library
-INFO stderr         2> Stack:
-INFO stderr         2> [email protected]$(SOURCE_DIR)/js/src/jit-test/tests/ctypes/conversion-native-function.js:15:14
-INFO stderr         2> @$(SOURCE_DIR)/js/src/jit-test/tests/ctypes/conversion-native-function.js:37:3
-$(SOURCE_DIR)/js/src/jit-test/tests/ctypes/conversion-native-function.js:15:14 Error: couldn't find function symbol in library
-Stack:
-  [email protected]$(SOURCE_DIR)/js/src/jit-test/tests/ctypes/conversion-native-function.js:15:14
-  @$(SOURCE_DIR)/js/src/jit-test/tests/ctypes/conversion-native-function.js:37:3
-Exit code: 3
-FAIL - ctypes/conversion-native-function.js
-TEST-UNEXPECTED-FAIL | js/src/jit-test/tests/ctypes/conversion-native-function.js | $(SOURCE_DIR)/js/src/jit-test/tests/ctypes/conversion-native-function.js:15:14 Error: couldn't find function symbol in library (code 3, args "--ion-eager --ion-offthread-compile=off --non-writable-jitcode --ion-check-range-analysis --ion-extra-checks --no-sse3 --no-threads")
-INFO exit-status     : 3
-INFO timed-out       : False
-INFO stderr         2> $(SOURCE_DIR)/js/src/jit-test/tests/ctypes/conversion-native-function.js:15:14 Error: couldn't find function symbol in library
-INFO stderr         2> Stack:
-INFO stderr         2> [email protected]$(SOURCE_DIR)/js/src/jit-test/tests/ctypes/conversion-native-function.js:15:14
-INFO stderr         2> @$(SOURCE_DIR)/js/src/jit-test/tests/ctypes/conversion-native-function.js:37:3
-$(SOURCE_DIR)/js/src/jit-test/tests/ctypes/conversion-native-function.js:15:14 Error: couldn't find function symbol in library
-Stack:
-  [email protected]$(SOURCE_DIR)/js/src/jit-test/tests/ctypes/conversion-native-function.js:15:14
-  @$(SOURCE_DIR)/js/src/jit-test/tests/ctypes/conversion-native-function.js:37:3
-Exit code: 3
-FAIL - ctypes/conversion-native-function.js
-TEST-UNEXPECTED-FAIL | js/src/jit-test/tests/ctypes/conversion-native-function.js | $(SOURCE_DIR)/js/src/jit-test/tests/ctypes/conversion-native-function.js:15:14 Error: couldn't find function symbol in library (code 3, args "--baseline-eager")
-INFO exit-status     : 3
-INFO timed-out       : False
-INFO stderr         2> $(SOURCE_DIR)/js/src/jit-test/tests/ctypes/conversion-native-function.js:15:14 Error: couldn't find function symbol in library
-INFO stderr         2> Stack:
-INFO stderr         2> [email protected]$(SOURCE_DIR)/js/src/jit-test/tests/ctypes/conversion-native-function.js:15:14
-INFO stderr         2> @$(SOURCE_DIR)/js/src/jit-test/tests/ctypes/conversion-native-function.js:37:3
-$(SOURCE_DIR)/js/src/jit-test/tests/ctypes/conversion-native-function.js:15:14 Error: couldn't find function symbol in library
-Stack:
-  [email protected]$(SOURCE_DIR)/js/src/jit-test/tests/ctypes/conversion-native-function.js:15:14
-  @$(SOURCE_DIR)/js/src/jit-test/tests/ctypes/conversion-native-function.js:37:3
-Exit code: 3
-FAIL - ctypes/conversion-native-function.js
-TEST-UNEXPECTED-FAIL | js/src/jit-test/tests/ctypes/conversion-native-function.js | $(SOURCE_DIR)/js/src/jit-test/tests/ctypes/conversion-native-function.js:15:14 Error: couldn't find function symbol in library (code 3, args "--baseline-eager --no-fpu")
-INFO exit-status     : 3
-INFO timed-out       : False
-INFO stderr         2> $(SOURCE_DIR)/js/src/jit-test/tests/ctypes/conversion-native-function.js:15:14 Error: couldn't find function symbol in library
-INFO stderr         2> Stack:
-INFO stderr         2> [email protected]$(SOURCE_DIR)/js/src/jit-test/tests/ctypes/conversion-native-function.js:15:14
-INFO stderr         2> @$(SOURCE_DIR)/js/src/jit-test/tests/ctypes/conversion-native-function.js:37:3
-$(SOURCE_DIR)/js/src/jit-test/tests/ctypes/conversion-native-function.js:15:14 Error: couldn't find function symbol in library
-Stack:
-  [email protected]$(SOURCE_DIR)/js/src/jit-test/tests/ctypes/conversion-native-function.js:15:14
-  @$(SOURCE_DIR)/js/src/jit-test/tests/ctypes/conversion-native-function.js:37:3
-Exit code: 3
-FAIL - ctypes/conversion-native-function.js
-TEST-UNEXPECTED-FAIL | js/src/jit-test/tests/ctypes/conversion-native-function.js | $(SOURCE_DIR)/js/src/jit-test/tests/ctypes/conversion-native-function.js:15:14 Error: couldn't find function symbol in library (code 3, args "--no-baseline --no-ion")
-INFO exit-status     : 3
-INFO timed-out       : False
-INFO stderr         2> $(SOURCE_DIR)/js/src/jit-test/tests/ctypes/conversion-native-function.js:15:14 Error: couldn't find function symbol in library
-INFO stderr         2> Stack:
-INFO stderr         2> [email protected]$(SOURCE_DIR)/js/src/jit-test/tests/ctypes/conversion-native-function.js:15:14
-INFO stderr         2> @$(SOURCE_DIR)/js/src/jit-test/tests/ctypes/conversion-native-function.js:37:3
-FAILURES:
-    $(@D)/dist/bin/js -f $(SOURCE_DIR)/js/src/jit-test/lib/prologue.js --js-cache $(SOURCE_DIR)/js/src/jit-test/.js-cache -e "const platform='sunos5'; const libdir='$(SOURCE_DIR)/js/src/jit-test/lib/'; const scriptdir='$(SOURCE_DIR)/js/src/jit-test/tests/ctypes/'" -f $(SOURCE_DIR)/js/src/jit-test/tests/ctypes/conversion-native-function.js
-    $(@D)/dist/bin/js -f $(SOURCE_DIR)/js/src/jit-test/lib/prologue.js --js-cache $(SOURCE_DIR)/js/src/jit-test/.js-cache --ion-eager --ion-offthread-compile=off -e "const platform='sunos5'; const libdir='$(SOURCE_DIR)/js/src/jit-test/lib/'; const scriptdir='$(SOURCE_DIR)/js/src/jit-test/tests/ctypes/'" -f $(SOURCE_DIR)/js/src/jit-test/tests/ctypes/conversion-native-function.js
-    $(@D)/dist/bin/js -f $(SOURCE_DIR)/js/src/jit-test/lib/prologue.js --js-cache $(SOURCE_DIR)/js/src/jit-test/.js-cache --ion-extra-checks --non-writable-jitcode --ion-check-range-analysis --ion-offthread-compile=off --no-threads --ion-eager --no-sse3 -e "const platform='sunos5'; const libdir='$(SOURCE_DIR)/js/src/jit-test/lib/'; const scriptdir='$(SOURCE_DIR)/js/src/jit-test/tests/ctypes/'" -f $(SOURCE_DIR)/js/src/jit-test/tests/ctypes/conversion-native-function.js
-    $(@D)/dist/bin/js -f $(SOURCE_DIR)/js/src/jit-test/lib/prologue.js --js-cache $(SOURCE_DIR)/js/src/jit-test/.js-cache --baseline-eager -e "const platform='sunos5'; const libdir='$(SOURCE_DIR)/js/src/jit-test/lib/'; const scriptdir='$(SOURCE_DIR)/js/src/jit-test/tests/ctypes/'" -f $(SOURCE_DIR)/js/src/jit-test/tests/ctypes/conversion-native-function.js
-    $(@D)/dist/bin/js -f $(SOURCE_DIR)/js/src/jit-test/lib/prologue.js --js-cache $(SOURCE_DIR)/js/src/jit-test/.js-cache --baseline-eager --no-fpu -e "const platform='sunos5'; const libdir='$(SOURCE_DIR)/js/src/jit-test/lib/'; const scriptdir='$(SOURCE_DIR)/js/src/jit-test/tests/ctypes/'" -f $(SOURCE_DIR)/js/src/jit-test/tests/ctypes/conversion-native-function.js
-    $(@D)/dist/bin/js -f $(SOURCE_DIR)/js/src/jit-test/lib/prologue.js --js-cache $(SOURCE_DIR)/js/src/jit-test/.js-cache --no-baseline --no-ion -e "const platform='sunos5'; const libdir='$(SOURCE_DIR)/js/src/jit-test/lib/'; const scriptdir='$(SOURCE_DIR)/js/src/jit-test/tests/ctypes/'" -f $(SOURCE_DIR)/js/src/jit-test/tests/ctypes/conversion-native-function.js
 TIMEOUTS:
 Result summary:
-Passed: 29675
+Passed: 29681
 Failed: 6
-make[1]: *** [Makefile:110: check-jit-test] Error 2
-make[1]: Leaving directory '$(@D)/js/src'
--- a/components/desktop/firefox/test/results-sparc.master	Mon Sep 26 10:05:24 2016 -0700
+++ b/components/desktop/firefox/test/results-sparc.master	Thu Sep 22 04:08:19 2016 -0700
@@ -1,781 +1,4 @@
-make[1]: Entering directory '$(@D)/js/src'
-../../dist/bin/run-mozilla.sh $(@D)/_virtualenv/bin/python -u $(SOURCE_DIR)/js/src/jit-test/jit_test.py \
-        --no-slow --no-progress --format=automation --jitflags=all -j 2 -f \
-		 \
-		 \
-        ../../dist/bin/js 
-$(SOURCE_DIR)/js/src/jit-test/tests/asm.js/testHeapAccess.js:24:1 Error: Assertion failed: got 0, expected 127
-Stack:
-  @$(SOURCE_DIR)/js/src/jit-test/tests/asm.js/testHeapAccess.js:24:1
-Exit code: 3
-FAIL - asm.js/testHeapAccess.js
-TEST-UNEXPECTED-FAIL | js/src/jit-test/tests/asm.js/testHeapAccess.js | $(SOURCE_DIR)/js/src/jit-test/tests/asm.js/testHeapAccess.js:24:1 Error: Assertion failed: got 0, expected 127 (code 3, args "")
-INFO exit-status     : 3
-INFO timed-out       : False
-INFO stderr         2> $(SOURCE_DIR)/js/src/jit-test/tests/asm.js/testHeapAccess.js:24:1 Error: Assertion failed: got 0, expected 127
-INFO stderr         2> Stack:
-INFO stderr         2> @$(SOURCE_DIR)/js/src/jit-test/tests/asm.js/testHeapAccess.js:24:1
-$(SOURCE_DIR)/js/src/jit-test/tests/asm.js/testHeapAccess.js:24:1 Error: Assertion failed: got 0, expected 127
-Stack:
-  @$(SOURCE_DIR)/js/src/jit-test/tests/asm.js/testHeapAccess.js:24:1
-Exit code: 3
-FAIL - asm.js/testHeapAccess.js
-TEST-UNEXPECTED-FAIL | js/src/jit-test/tests/asm.js/testHeapAccess.js | $(SOURCE_DIR)/js/src/jit-test/tests/asm.js/testHeapAccess.js:24:1 Error: Assertion failed: got 0, expected 127 (code 3, args "--ion-eager --ion-offthread-compile=off")
-INFO exit-status     : 3
-INFO timed-out       : False
-INFO stderr         2> $(SOURCE_DIR)/js/src/jit-test/tests/asm.js/testHeapAccess.js:24:1 Error: Assertion failed: got 0, expected 127
-INFO stderr         2> Stack:
-INFO stderr         2> @$(SOURCE_DIR)/js/src/jit-test/tests/asm.js/testHeapAccess.js:24:1
-$(SOURCE_DIR)/js/src/jit-test/tests/asm.js/testHeapAccess.js:24:1 Error: Assertion failed: got 0, expected 127
-Stack:
-  @$(SOURCE_DIR)/js/src/jit-test/tests/asm.js/testHeapAccess.js:24:1
-Exit code: 3
-FAIL - asm.js/testHeapAccess.js
-TEST-UNEXPECTED-FAIL | js/src/jit-test/tests/asm.js/testHeapAccess.js | $(SOURCE_DIR)/js/src/jit-test/tests/asm.js/testHeapAccess.js:24:1 Error: Assertion failed: got 0, expected 127 (code 3, args "--ion-eager --ion-offthread-compile=off --non-writable-jitcode --ion-check-range-analysis --ion-extra-checks --no-sse3 --no-threads")
-INFO exit-status     : 3
-INFO timed-out       : False
-INFO stderr         2> $(SOURCE_DIR)/js/src/jit-test/tests/asm.js/testHeapAccess.js:24:1 Error: Assertion failed: got 0, expected 127
-INFO stderr         2> Stack:
-INFO stderr         2> @$(SOURCE_DIR)/js/src/jit-test/tests/asm.js/testHeapAccess.js:24:1
-$(SOURCE_DIR)/js/src/jit-test/tests/asm.js/testHeapAccess.js:24:1 Error: Assertion failed: got 0, expected 127
-Stack:
-  @$(SOURCE_DIR)/js/src/jit-test/tests/asm.js/testHeapAccess.js:24:1
-Exit code: 3
-FAIL - asm.js/testHeapAccess.js
-TEST-UNEXPECTED-FAIL | js/src/jit-test/tests/asm.js/testHeapAccess.js | $(SOURCE_DIR)/js/src/jit-test/tests/asm.js/testHeapAccess.js:24:1 Error: Assertion failed: got 0, expected 127 (code 3, args "--baseline-eager")
-INFO exit-status     : 3
-INFO timed-out       : False
-INFO stderr         2> $(SOURCE_DIR)/js/src/jit-test/tests/asm.js/testHeapAccess.js:24:1 Error: Assertion failed: got 0, expected 127
-INFO stderr         2> Stack:
-INFO stderr         2> @$(SOURCE_DIR)/js/src/jit-test/tests/asm.js/testHeapAccess.js:24:1
-$(SOURCE_DIR)/js/src/jit-test/tests/asm.js/testHeapAccess.js:24:1 Error: Assertion failed: got 0, expected 127
-Stack:
-  @$(SOURCE_DIR)/js/src/jit-test/tests/asm.js/testHeapAccess.js:24:1
-Exit code: 3
-FAIL - asm.js/testHeapAccess.js
-TEST-UNEXPECTED-FAIL | js/src/jit-test/tests/asm.js/testHeapAccess.js | $(SOURCE_DIR)/js/src/jit-test/tests/asm.js/testHeapAccess.js:24:1 Error: Assertion failed: got 0, expected 127 (code 3, args "--baseline-eager --no-fpu")
-INFO exit-status     : 3
-INFO timed-out       : False
-INFO stderr         2> $(SOURCE_DIR)/js/src/jit-test/tests/asm.js/testHeapAccess.js:24:1 Error: Assertion failed: got 0, expected 127
-INFO stderr         2> Stack:
-INFO stderr         2> @$(SOURCE_DIR)/js/src/jit-test/tests/asm.js/testHeapAccess.js:24:1
-$(SOURCE_DIR)/js/src/jit-test/tests/asm.js/testHeapAccess.js:24:1 Error: Assertion failed: got 0, expected 127
-Stack:
-  @$(SOURCE_DIR)/js/src/jit-test/tests/asm.js/testHeapAccess.js:24:1
-Exit code: 3
-FAIL - asm.js/testHeapAccess.js
-TEST-UNEXPECTED-FAIL | js/src/jit-test/tests/asm.js/testHeapAccess.js | $(SOURCE_DIR)/js/src/jit-test/tests/asm.js/testHeapAccess.js:24:1 Error: Assertion failed: got 0, expected 127 (code 3, args "--no-baseline --no-ion")
-INFO exit-status     : 3
-INFO timed-out       : False
-INFO stderr         2> $(SOURCE_DIR)/js/src/jit-test/tests/asm.js/testHeapAccess.js:24:1 Error: Assertion failed: got 0, expected 127
-INFO stderr         2> Stack:
-INFO stderr         2> @$(SOURCE_DIR)/js/src/jit-test/tests/asm.js/testHeapAccess.js:24:1
-$(SOURCE_DIR)/js/src/jit-test/tests/asm.js/testHeapAccess.js:24:1 Error: Assertion failed: got 0, expected 127
-Stack:
-  @$(SOURCE_DIR)/js/src/jit-test/tests/asm.js/testHeapAccess.js:24:1
-Exit code: 3
-FAIL - asm.js/testHeapAccess.js
-TEST-UNEXPECTED-FAIL | js/src/jit-test/tests/asm.js/testHeapAccess.js | $(SOURCE_DIR)/js/src/jit-test/tests/asm.js/testHeapAccess.js:24:1 Error: Assertion failed: got 0, expected 127 (code 3, args "--no-asmjs")
-INFO exit-status     : 3
-INFO timed-out       : False
-INFO stderr         2> $(SOURCE_DIR)/js/src/jit-test/tests/asm.js/testHeapAccess.js:24:1 Error: Assertion failed: got 0, expected 127
-INFO stderr         2> Stack:
-INFO stderr         2> @$(SOURCE_DIR)/js/src/jit-test/tests/asm.js/testHeapAccess.js:24:1
-Cannot find `BRDA:3,0,0,1` in the following Lcov result:
- TN:Compartment_5fedaedc00
-SF:$(SOURCE_DIR)/js/src/jit-test/tests/coverage/simple.js line 60 > eval
-FN:1,top-level
-FNDA:1,top-level
-FNF:1
-FNH:1
-BRDA:3,0,0,0
-BRDA:3,0,1,-
-BRF:2
-BRH:1
-DA:2,1
-DA:3,1
-DA:4,0
-DA:5,1
-LF:4
-LH:3
-end_of_record
-
-In the following source:
-  //FN:$,top-level //FNDA:1,%
-  var l = ",".split(','); //DA:$,1
-  if (l.length == 3)      //DA:$,1 //BRDA:$,0,0,1 //BRDA:$,0,1,-
-    l.push('');           //DA:$,0
-  l.pop();                //DA:$,1
-  //FNF:1
-  //FNH:1
-  //LF:4
-  //LH:3
-  //BRF:2
-  //BRH:1
-
-$(SOURCE_DIR)/js/src/jit-test/tests/coverage/simple.js:69:7 Error: Assertion failed: got true, expected false
-Stack:
-  [email protected]$(SOURCE_DIR)/js/src/jit-test/tests/coverage/simple.js:69:7
-  @$(SOURCE_DIR)/js/src/jit-test/tests/coverage/simple.js:104:1
-Exit code: 3
-FAIL - coverage/simple.js
-TEST-UNEXPECTED-FAIL | js/src/jit-test/tests/coverage/simple.js | $(SOURCE_DIR)/js/src/jit-test/tests/coverage/simple.js:69:7 Error: Assertion failed: got true, expected false (code 3, args "--code-coverage")
-INFO exit-status     : 3
-INFO timed-out       : False
-INFO stdout          > Cannot find `BRDA:3,0,0,1` in the following Lcov result:
-INFO stdout          > TN:Compartment_5fedaedc00
-INFO stdout          > SF:$(SOURCE_DIR)/js/src/jit-test/tests/coverage/simple.js line 60 > eval
-INFO stdout          > FN:1,top-level
-INFO stdout          > FNDA:1,top-level
-INFO stdout          > FNF:1
-INFO stdout          > FNH:1
-INFO stdout          > BRDA:3,0,0,0
-INFO stdout          > BRDA:3,0,1,-
-INFO stdout          > BRF:2
-INFO stdout          > BRH:1
-INFO stdout          > DA:2,1
-INFO stdout          > DA:3,1
-INFO stdout          > DA:4,0
-INFO stdout          > DA:5,1
-INFO stdout          > LF:4
-INFO stdout          > LH:3
-INFO stdout          > end_of_record
-INFO stdout          > 
-INFO stdout          > In the following source:
-INFO stdout          > //FN:$,top-level //FNDA:1,%
-INFO stdout          > var l = ",".split(','); //DA:$,1
-INFO stdout          > if (l.length == 3)      //DA:$,1 //BRDA:$,0,0,1 //BRDA:$,0,1,-
-INFO stdout          > l.push('');           //DA:$,0
-INFO stdout          > l.pop();                //DA:$,1
-INFO stdout          > //FNF:1
-INFO stdout          > //FNH:1
-INFO stdout          > //LF:4
-INFO stdout          > //LH:3
-INFO stdout          > //BRF:2
-INFO stdout          > //BRH:1
-INFO stdout          > 
-INFO stderr         2> $(SOURCE_DIR)/js/src/jit-test/tests/coverage/simple.js:69:7 Error: Assertion failed: got true, expected false
-INFO stderr         2> Stack:
-INFO stderr         2> [email protected]$(SOURCE_DIR)/js/src/jit-test/tests/coverage/simple.js:69:7
-INFO stderr         2> @$(SOURCE_DIR)/js/src/jit-test/tests/coverage/simple.js:104:1
-Cannot find `BRDA:3,0,0,1` in the following Lcov result:
- TN:Compartment_5fe3eedc00
-SF:$(SOURCE_DIR)/js/src/jit-test/tests/coverage/simple.js line 60 > eval
-FN:1,top-level
-FNDA:1,top-level
-FNF:1
-FNH:1
-BRDA:3,0,0,0
-BRDA:3,0,1,-
-BRF:2
-BRH:1
-DA:2,1
-DA:3,1
-DA:4,0
-DA:5,1
-LF:4
-LH:3
-end_of_record
-
-In the following source:
-  //FN:$,top-level //FNDA:1,%
-  var l = ",".split(','); //DA:$,1
-  if (l.length == 3)      //DA:$,1 //BRDA:$,0,0,1 //BRDA:$,0,1,-
-    l.push('');           //DA:$,0
-  l.pop();                //DA:$,1
-  //FNF:1
-  //FNH:1
-  //LF:4
-  //LH:3
-  //BRF:2
-  //BRH:1
-
-$(SOURCE_DIR)/js/src/jit-test/tests/coverage/simple.js:69:7 Error: Assertion failed: got true, expected false
-Stack:
-  [email protected]$(SOURCE_DIR)/js/src/jit-test/tests/coverage/simple.js:69:7
-  @$(SOURCE_DIR)/js/src/jit-test/tests/coverage/simple.js:104:1
-Exit code: 3
-FAIL - coverage/simple.js
-TEST-UNEXPECTED-FAIL | js/src/jit-test/tests/coverage/simple.js | $(SOURCE_DIR)/js/src/jit-test/tests/coverage/simple.js:69:7 Error: Assertion failed: got true, expected false (code 3, args "--code-coverage --ion-eager --ion-offthread-compile=off")
-INFO exit-status     : 3
-INFO timed-out       : False
-INFO stdout          > Cannot find `BRDA:3,0,0,1` in the following Lcov result:
-INFO stdout          > TN:Compartment_5fe3eedc00
-INFO stdout          > SF:$(SOURCE_DIR)/js/src/jit-test/tests/coverage/simple.js line 60 > eval
-INFO stdout          > FN:1,top-level
-INFO stdout          > FNDA:1,top-level
-INFO stdout          > FNF:1
-INFO stdout          > FNH:1
-INFO stdout          > BRDA:3,0,0,0
-INFO stdout          > BRDA:3,0,1,-
-INFO stdout          > BRF:2
-INFO stdout          > BRH:1
-INFO stdout          > DA:2,1
-INFO stdout          > DA:3,1
-INFO stdout          > DA:4,0
-INFO stdout          > DA:5,1
-INFO stdout          > LF:4
-INFO stdout          > LH:3
-INFO stdout          > end_of_record
-INFO stdout          > 
-INFO stdout          > In the following source:
-INFO stdout          > //FN:$,top-level //FNDA:1,%
-INFO stdout          > var l = ",".split(','); //DA:$,1
-INFO stdout          > if (l.length == 3)      //DA:$,1 //BRDA:$,0,0,1 //BRDA:$,0,1,-
-INFO stdout          > l.push('');           //DA:$,0
-INFO stdout          > l.pop();                //DA:$,1
-INFO stdout          > //FNF:1
-INFO stdout          > //FNH:1
-INFO stdout          > //LF:4
-INFO stdout          > //LH:3
-INFO stdout          > //BRF:2
-INFO stdout          > //BRH:1
-INFO stdout          > 
-INFO stderr         2> $(SOURCE_DIR)/js/src/jit-test/tests/coverage/simple.js:69:7 Error: Assertion failed: got true, expected false
-INFO stderr         2> Stack:
-INFO stderr         2> [email protected]$(SOURCE_DIR)/js/src/jit-test/tests/coverage/simple.js:69:7
-INFO stderr         2> @$(SOURCE_DIR)/js/src/jit-test/tests/coverage/simple.js:104:1
-Cannot find `BRDA:3,0,0,1` in the following Lcov result:
- TN:Compartment_5feb207c00
-SF:$(SOURCE_DIR)/js/src/jit-test/tests/coverage/simple.js line 60 > eval
-FN:1,top-level
-FNDA:1,top-level
-FNF:1
-FNH:1
-BRDA:3,0,0,0
-BRDA:3,0,1,-
-BRF:2
-BRH:1
-DA:2,1
-DA:3,1
-DA:4,0
-DA:5,1
-LF:4
-LH:3
-end_of_record
-
-In the following source:
-  //FN:$,top-level //FNDA:1,%
-  var l = ",".split(','); //DA:$,1
-  if (l.length == 3)      //DA:$,1 //BRDA:$,0,0,1 //BRDA:$,0,1,-
-    l.push('');           //DA:$,0
-  l.pop();                //DA:$,1
-  //FNF:1
-  //FNH:1
-  //LF:4
-  //LH:3
-  //BRF:2
-  //BRH:1
-
-$(SOURCE_DIR)/js/src/jit-test/tests/coverage/simple.js:69:7 Error: Assertion failed: got true, expected false
-Stack:
-  [email protected]$(SOURCE_DIR)/js/src/jit-test/tests/coverage/simple.js:69:7
-  @$(SOURCE_DIR)/js/src/jit-test/tests/coverage/simple.js:104:1
-Exit code: 3
-FAIL - coverage/simple.js
-TEST-UNEXPECTED-FAIL | js/src/jit-test/tests/coverage/simple.js | $(SOURCE_DIR)/js/src/jit-test/tests/coverage/simple.js:69:7 Error: Assertion failed: got true, expected false (code 3, args "--code-coverage --ion-eager --ion-offthread-compile=off --non-writable-jitcode --ion-check-range-analysis --ion-extra-checks --no-sse3 --no-threads")
-INFO exit-status     : 3
-INFO timed-out       : False
-INFO stdout          > Cannot find `BRDA:3,0,0,1` in the following Lcov result:
-INFO stdout          > TN:Compartment_5feb207c00
-INFO stdout          > SF:$(SOURCE_DIR)/js/src/jit-test/tests/coverage/simple.js line 60 > eval
-INFO stdout          > FN:1,top-level
-INFO stdout          > FNDA:1,top-level
-INFO stdout          > FNF:1
-INFO stdout          > FNH:1
-INFO stdout          > BRDA:3,0,0,0
-INFO stdout          > BRDA:3,0,1,-
-INFO stdout          > BRF:2
-INFO stdout          > BRH:1
-INFO stdout          > DA:2,1
-INFO stdout          > DA:3,1
-INFO stdout          > DA:4,0
-INFO stdout          > DA:5,1
-INFO stdout          > LF:4
-INFO stdout          > LH:3
-INFO stdout          > end_of_record
-INFO stdout          > 
-INFO stdout          > In the following source:
-INFO stdout          > //FN:$,top-level //FNDA:1,%
-INFO stdout          > var l = ",".split(','); //DA:$,1
-INFO stdout          > if (l.length == 3)      //DA:$,1 //BRDA:$,0,0,1 //BRDA:$,0,1,-
-INFO stdout          > l.push('');           //DA:$,0
-INFO stdout          > l.pop();                //DA:$,1
-INFO stdout          > //FNF:1
-INFO stdout          > //FNH:1
-INFO stdout          > //LF:4
-INFO stdout          > //LH:3
-INFO stdout          > //BRF:2
-INFO stdout          > //BRH:1
-INFO stdout          > 
-INFO stderr         2> $(SOURCE_DIR)/js/src/jit-test/tests/coverage/simple.js:69:7 Error: Assertion failed: got true, expected false
-INFO stderr         2> Stack:
-INFO stderr         2> [email protected]$(SOURCE_DIR)/js/src/jit-test/tests/coverage/simple.js:69:7
-INFO stderr         2> @$(SOURCE_DIR)/js/src/jit-test/tests/coverage/simple.js:104:1
-Cannot find `BRDA:3,0,0,1` in the following Lcov result:
- TN:Compartment_5feeeedc00
-SF:$(SOURCE_DIR)/js/src/jit-test/tests/coverage/simple.js line 60 > eval
-FN:1,top-level
-FNDA:1,top-level
-FNF:1
-FNH:1
-BRDA:3,0,0,0
-BRDA:3,0,1,-
-BRF:2
-BRH:1
-DA:2,1
-DA:3,1
-DA:4,0
-DA:5,1
-LF:4
-LH:3
-end_of_record
-
-In the following source:
-  //FN:$,top-level //FNDA:1,%
-  var l = ",".split(','); //DA:$,1
-  if (l.length == 3)      //DA:$,1 //BRDA:$,0,0,1 //BRDA:$,0,1,-
-    l.push('');           //DA:$,0
-  l.pop();                //DA:$,1
-  //FNF:1
-  //FNH:1
-  //LF:4
-  //LH:3
-  //BRF:2
-  //BRH:1
-
-$(SOURCE_DIR)/js/src/jit-test/tests/coverage/simple.js:69:7 Error: Assertion failed: got true, expected false
-Stack:
-  [email protected]$(SOURCE_DIR)/js/src/jit-test/tests/coverage/simple.js:69:7
-  @$(SOURCE_DIR)/js/src/jit-test/tests/coverage/simple.js:104:1
-Exit code: 3
-FAIL - coverage/simple.js
-TEST-UNEXPECTED-FAIL | js/src/jit-test/tests/coverage/simple.js | $(SOURCE_DIR)/js/src/jit-test/tests/coverage/simple.js:69:7 Error: Assertion failed: got true, expected false (code 3, args "--code-coverage --baseline-eager")
-INFO exit-status     : 3
-INFO timed-out       : False
-INFO stdout          > Cannot find `BRDA:3,0,0,1` in the following Lcov result:
-INFO stdout          > TN:Compartment_5feeeedc00
-INFO stdout          > SF:$(SOURCE_DIR)/js/src/jit-test/tests/coverage/simple.js line 60 > eval
-INFO stdout          > FN:1,top-level
-INFO stdout          > FNDA:1,top-level
-INFO stdout          > FNF:1
-INFO stdout          > FNH:1
-INFO stdout          > BRDA:3,0,0,0
-INFO stdout          > BRDA:3,0,1,-
-INFO stdout          > BRF:2
-INFO stdout          > BRH:1
-INFO stdout          > DA:2,1
-INFO stdout          > DA:3,1
-INFO stdout          > DA:4,0
-INFO stdout          > DA:5,1
-INFO stdout          > LF:4
-INFO stdout          > LH:3
-INFO stdout          > end_of_record
-INFO stdout          > 
-INFO stdout          > In the following source:
-INFO stdout          > //FN:$,top-level //FNDA:1,%
-INFO stdout          > var l = ",".split(','); //DA:$,1
-INFO stdout          > if (l.length == 3)      //DA:$,1 //BRDA:$,0,0,1 //BRDA:$,0,1,-
-INFO stdout          > l.push('');           //DA:$,0
-INFO stdout          > l.pop();                //DA:$,1
-INFO stdout          > //FNF:1
-INFO stdout          > //FNH:1
-INFO stdout          > //LF:4
-INFO stdout          > //LH:3
-INFO stdout          > //BRF:2
-INFO stdout          > //BRH:1
-INFO stdout          > 
-INFO stderr         2> $(SOURCE_DIR)/js/src/jit-test/tests/coverage/simple.js:69:7 Error: Assertion failed: got true, expected false
-INFO stderr         2> Stack:
-INFO stderr         2> [email protected]$(SOURCE_DIR)/js/src/jit-test/tests/coverage/simple.js:69:7
-INFO stderr         2> @$(SOURCE_DIR)/js/src/jit-test/tests/coverage/simple.js:104:1
-Cannot find `BRDA:3,0,0,1` in the following Lcov result:
- TN:Compartment_5fe66edc00
-SF:$(SOURCE_DIR)/js/src/jit-test/tests/coverage/simple.js line 60 > eval
-FN:1,top-level
-FNDA:1,top-level
-FNF:1
-FNH:1
-BRDA:3,0,0,0
-BRDA:3,0,1,-
-BRF:2
-BRH:1
-DA:2,1
-DA:3,1
-DA:4,0
-DA:5,1
-LF:4
-LH:3
-end_of_record
-
-In the following source:
-  //FN:$,top-level //FNDA:1,%
-  var l = ",".split(','); //DA:$,1
-  if (l.length == 3)      //DA:$,1 //BRDA:$,0,0,1 //BRDA:$,0,1,-
-    l.push('');           //DA:$,0
-  l.pop();                //DA:$,1
-  //FNF:1
-  //FNH:1
-  //LF:4
-  //LH:3
-  //BRF:2
-  //BRH:1
-
-$(SOURCE_DIR)/js/src/jit-test/tests/coverage/simple.js:69:7 Error: Assertion failed: got true, expected false
-Stack:
-  [email protected]$(SOURCE_DIR)/js/src/jit-test/tests/coverage/simple.js:69:7
-  @$(SOURCE_DIR)/js/src/jit-test/tests/coverage/simple.js:104:1
-Exit code: 3
-FAIL - coverage/simple.js
-TEST-UNEXPECTED-FAIL | js/src/jit-test/tests/coverage/simple.js | $(SOURCE_DIR)/js/src/jit-test/tests/coverage/simple.js:69:7 Error: Assertion failed: got true, expected false (code 3, args "--code-coverage --baseline-eager --no-fpu")
-INFO exit-status     : 3
-INFO timed-out       : False
-INFO stdout          > Cannot find `BRDA:3,0,0,1` in the following Lcov result:
-INFO stdout          > TN:Compartment_5fe66edc00
-INFO stdout          > SF:$(SOURCE_DIR)/js/src/jit-test/tests/coverage/simple.js line 60 > eval
-INFO stdout          > FN:1,top-level
-INFO stdout          > FNDA:1,top-level
-INFO stdout          > FNF:1
-INFO stdout          > FNH:1
-INFO stdout          > BRDA:3,0,0,0
-INFO stdout          > BRDA:3,0,1,-
-INFO stdout          > BRF:2
-INFO stdout          > BRH:1
-INFO stdout          > DA:2,1
-INFO stdout          > DA:3,1
-INFO stdout          > DA:4,0
-INFO stdout          > DA:5,1
-INFO stdout          > LF:4
-INFO stdout          > LH:3
-INFO stdout          > end_of_record
-INFO stdout          > 
-INFO stdout          > In the following source:
-INFO stdout          > //FN:$,top-level //FNDA:1,%
-INFO stdout          > var l = ",".split(','); //DA:$,1
-INFO stdout          > if (l.length == 3)      //DA:$,1 //BRDA:$,0,0,1 //BRDA:$,0,1,-
-INFO stdout          > l.push('');           //DA:$,0
-INFO stdout          > l.pop();                //DA:$,1
-INFO stdout          > //FNF:1
-INFO stdout          > //FNH:1
-INFO stdout          > //LF:4
-INFO stdout          > //LH:3
-INFO stdout          > //BRF:2
-INFO stdout          > //BRH:1
-INFO stdout          > 
-INFO stderr         2> $(SOURCE_DIR)/js/src/jit-test/tests/coverage/simple.js:69:7 Error: Assertion failed: got true, expected false
-INFO stderr         2> Stack:
-INFO stderr         2> [email protected]$(SOURCE_DIR)/js/src/jit-test/tests/coverage/simple.js:69:7
-INFO stderr         2> @$(SOURCE_DIR)/js/src/jit-test/tests/coverage/simple.js:104:1
-Cannot find `BRDA:3,0,0,1` in the following Lcov result:
- TN:Compartment_5fe80edc00
-SF:$(SOURCE_DIR)/js/src/jit-test/tests/coverage/simple.js line 60 > eval
-FN:1,top-level
-FNDA:1,top-level
-FNF:1
-FNH:1
-BRDA:3,0,0,0
-BRDA:3,0,1,-
-BRF:2
-BRH:1
-DA:2,1
-DA:3,1
-DA:4,0
-DA:5,1
-LF:4
-LH:3
-end_of_record
-
-In the following source:
-  //FN:$,top-level //FNDA:1,%
-  var l = ",".split(','); //DA:$,1
-  if (l.length == 3)      //DA:$,1 //BRDA:$,0,0,1 //BRDA:$,0,1,-
-    l.push('');           //DA:$,0
-  l.pop();                //DA:$,1
-  //FNF:1
-  //FNH:1
-  //LF:4
-  //LH:3
-  //BRF:2
-  //BRH:1
-
-$(SOURCE_DIR)/js/src/jit-test/tests/coverage/simple.js:69:7 Error: Assertion failed: got true, expected false
-Stack:
-  [email protected]$(SOURCE_DIR)/js/src/jit-test/tests/coverage/simple.js:69:7
-  @$(SOURCE_DIR)/js/src/jit-test/tests/coverage/simple.js:104:1
-Exit code: 3
-FAIL - coverage/simple.js
-TEST-UNEXPECTED-FAIL | js/src/jit-test/tests/coverage/simple.js | $(SOURCE_DIR)/js/src/jit-test/tests/coverage/simple.js:69:7 Error: Assertion failed: got true, expected false (code 3, args "--code-coverage --no-baseline --no-ion")
-INFO exit-status     : 3
-INFO timed-out       : False
-INFO stdout          > Cannot find `BRDA:3,0,0,1` in the following Lcov result:
-INFO stdout          > TN:Compartment_5fe80edc00
-INFO stdout          > SF:$(SOURCE_DIR)/js/src/jit-test/tests/coverage/simple.js line 60 > eval
-INFO stdout          > FN:1,top-level
-INFO stdout          > FNDA:1,top-level
-INFO stdout          > FNF:1
-INFO stdout          > FNH:1
-INFO stdout          > BRDA:3,0,0,0
-INFO stdout          > BRDA:3,0,1,-
-INFO stdout          > BRF:2
-INFO stdout          > BRH:1
-INFO stdout          > DA:2,1
-INFO stdout          > DA:3,1
-INFO stdout          > DA:4,0
-INFO stdout          > DA:5,1
-INFO stdout          > LF:4
-INFO stdout          > LH:3
-INFO stdout          > end_of_record
-INFO stdout          > 
-INFO stdout          > In the following source:
-INFO stdout          > //FN:$,top-level //FNDA:1,%
-INFO stdout          > var l = ",".split(','); //DA:$,1
-INFO stdout          > if (l.length == 3)      //DA:$,1 //BRDA:$,0,0,1 //BRDA:$,0,1,-
-INFO stdout          > l.push('');           //DA:$,0
-INFO stdout          > l.pop();                //DA:$,1
-INFO stdout          > //FNF:1
-INFO stdout          > //FNH:1
-INFO stdout          > //LF:4
-INFO stdout          > //LH:3
-INFO stdout          > //BRF:2
-INFO stdout          > //BRH:1
-INFO stdout          > 
-INFO stderr         2> $(SOURCE_DIR)/js/src/jit-test/tests/coverage/simple.js:69:7 Error: Assertion failed: got true, expected false
-INFO stderr         2> Stack:
-INFO stderr         2> [email protected]$(SOURCE_DIR)/js/src/jit-test/tests/coverage/simple.js:69:7
-INFO stderr         2> @$(SOURCE_DIR)/js/src/jit-test/tests/coverage/simple.js:104:1
-$(SOURCE_DIR)/js/src/jit-test/tests/ctypes/conversion-native-function.js:15:14 Error: couldn't find function symbol in library
-Stack:
-  [email protected]$(SOURCE_DIR)/js/src/jit-test/tests/ctypes/conversion-native-function.js:15:14
-  @$(SOURCE_DIR)/js/src/jit-test/tests/ctypes/conversion-native-function.js:37:3
-Exit code: 3
-FAIL - ctypes/conversion-native-function.js
-TEST-UNEXPECTED-FAIL | js/src/jit-test/tests/ctypes/conversion-native-function.js | $(SOURCE_DIR)/js/src/jit-test/tests/ctypes/conversion-native-function.js:15:14 Error: couldn't find function symbol in library (code 3, args "")
-INFO exit-status     : 3
-INFO timed-out       : False
-INFO stderr         2> $(SOURCE_DIR)/js/src/jit-test/tests/ctypes/conversion-native-function.js:15:14 Error: couldn't find function symbol in library
-INFO stderr         2> Stack:
-INFO stderr         2> [email protected]$(SOURCE_DIR)/js/src/jit-test/tests/ctypes/conversion-native-function.js:15:14
-INFO stderr         2> @$(SOURCE_DIR)/js/src/jit-test/tests/ctypes/conversion-native-function.js:37:3
-$(SOURCE_DIR)/js/src/jit-test/tests/ctypes/conversion-native-function.js:15:14 Error: couldn't find function symbol in library
-Stack:
-  [email protected]$(SOURCE_DIR)/js/src/jit-test/tests/ctypes/conversion-native-function.js:15:14
-  @$(SOURCE_DIR)/js/src/jit-test/tests/ctypes/conversion-native-function.js:37:3
-Exit code: 3
-FAIL - ctypes/conversion-native-function.js
-TEST-UNEXPECTED-FAIL | js/src/jit-test/tests/ctypes/conversion-native-function.js | $(SOURCE_DIR)/js/src/jit-test/tests/ctypes/conversion-native-function.js:15:14 Error: couldn't find function symbol in library (code 3, args "--ion-eager --ion-offthread-compile=off")
-INFO exit-status     : 3
-INFO timed-out       : False
-INFO stderr         2> $(SOURCE_DIR)/js/src/jit-test/tests/ctypes/conversion-native-function.js:15:14 Error: couldn't find function symbol in library
-INFO stderr         2> Stack:
-INFO stderr         2> [email protected]$(SOURCE_DIR)/js/src/jit-test/tests/ctypes/conversion-native-function.js:15:14
-INFO stderr         2> @$(SOURCE_DIR)/js/src/jit-test/tests/ctypes/conversion-native-function.js:37:3
-$(SOURCE_DIR)/js/src/jit-test/tests/ctypes/conversion-native-function.js:15:14 Error: couldn't find function symbol in library
-Stack:
-  [email protected]$(SOURCE_DIR)/js/src/jit-test/tests/ctypes/conversion-native-function.js:15:14
-  @$(SOURCE_DIR)/js/src/jit-test/tests/ctypes/conversion-native-function.js:37:3
-Exit code: 3
-FAIL - ctypes/conversion-native-function.js
-TEST-UNEXPECTED-FAIL | js/src/jit-test/tests/ctypes/conversion-native-function.js | $(SOURCE_DIR)/js/src/jit-test/tests/ctypes/conversion-native-function.js:15:14 Error: couldn't find function symbol in library (code 3, args "--ion-eager --ion-offthread-compile=off --non-writable-jitcode --ion-check-range-analysis --ion-extra-checks --no-sse3 --no-threads")
-INFO exit-status     : 3
-INFO timed-out       : False
-INFO stderr         2> $(SOURCE_DIR)/js/src/jit-test/tests/ctypes/conversion-native-function.js:15:14 Error: couldn't find function symbol in library
-INFO stderr         2> Stack:
-INFO stderr         2> [email protected]$(SOURCE_DIR)/js/src/jit-test/tests/ctypes/conversion-native-function.js:15:14
-INFO stderr         2> @$(SOURCE_DIR)/js/src/jit-test/tests/ctypes/conversion-native-function.js:37:3
-$(SOURCE_DIR)/js/src/jit-test/tests/ctypes/conversion-native-function.js:15:14 Error: couldn't find function symbol in library
-Stack:
-  [email protected]$(SOURCE_DIR)/js/src/jit-test/tests/ctypes/conversion-native-function.js:15:14
-  @$(SOURCE_DIR)/js/src/jit-test/tests/ctypes/conversion-native-function.js:37:3
-Exit code: 3
-FAIL - ctypes/conversion-native-function.js
-TEST-UNEXPECTED-FAIL | js/src/jit-test/tests/ctypes/conversion-native-function.js | $(SOURCE_DIR)/js/src/jit-test/tests/ctypes/conversion-native-function.js:15:14 Error: couldn't find function symbol in library (code 3, args "--baseline-eager")
-INFO exit-status     : 3
-INFO timed-out       : False
-INFO stderr         2> $(SOURCE_DIR)/js/src/jit-test/tests/ctypes/conversion-native-function.js:15:14 Error: couldn't find function symbol in library
-INFO stderr         2> Stack:
-INFO stderr         2> [email protected]$(SOURCE_DIR)/js/src/jit-test/tests/ctypes/conversion-native-function.js:15:14
-INFO stderr         2> @$(SOURCE_DIR)/js/src/jit-test/tests/ctypes/conversion-native-function.js:37:3
-$(SOURCE_DIR)/js/src/jit-test/tests/ctypes/conversion-native-function.js:15:14 Error: couldn't find function symbol in library
-Stack:
-  [email protected]$(SOURCE_DIR)/js/src/jit-test/tests/ctypes/conversion-native-function.js:15:14
-  @$(SOURCE_DIR)/js/src/jit-test/tests/ctypes/conversion-native-function.js:37:3
-Exit code: 3
-FAIL - ctypes/conversion-native-function.js
-TEST-UNEXPECTED-FAIL | js/src/jit-test/tests/ctypes/conversion-native-function.js | $(SOURCE_DIR)/js/src/jit-test/tests/ctypes/conversion-native-function.js:15:14 Error: couldn't find function symbol in library (code 3, args "--baseline-eager --no-fpu")
-INFO exit-status     : 3
-INFO timed-out       : False
-INFO stderr         2> $(SOURCE_DIR)/js/src/jit-test/tests/ctypes/conversion-native-function.js:15:14 Error: couldn't find function symbol in library
-INFO stderr         2> Stack:
-INFO stderr         2> [email protected]$(SOURCE_DIR)/js/src/jit-test/tests/ctypes/conversion-native-function.js:15:14
-INFO stderr         2> @$(SOURCE_DIR)/js/src/jit-test/tests/ctypes/conversion-native-function.js:37:3
-$(SOURCE_DIR)/js/src/jit-test/tests/ctypes/conversion-native-function.js:15:14 Error: couldn't find function symbol in library
-Stack:
-  [email protected]$(SOURCE_DIR)/js/src/jit-test/tests/ctypes/conversion-native-function.js:15:14
-  @$(SOURCE_DIR)/js/src/jit-test/tests/ctypes/conversion-native-function.js:37:3
-Exit code: 3
-FAIL - ctypes/conversion-native-function.js
-TEST-UNEXPECTED-FAIL | js/src/jit-test/tests/ctypes/conversion-native-function.js | $(SOURCE_DIR)/js/src/jit-test/tests/ctypes/conversion-native-function.js:15:14 Error: couldn't find function symbol in library (code 3, args "--no-baseline --no-ion")
-INFO exit-status     : 3
-INFO timed-out       : False
-INFO stderr         2> $(SOURCE_DIR)/js/src/jit-test/tests/ctypes/conversion-native-function.js:15:14 Error: couldn't find function symbol in library
-INFO stderr         2> Stack:
-INFO stderr         2> [email protected]$(SOURCE_DIR)/js/src/jit-test/tests/ctypes/conversion-native-function.js:15:14
-INFO stderr         2> @$(SOURCE_DIR)/js/src/jit-test/tests/ctypes/conversion-native-function.js:37:3
-$(SOURCE_DIR)/js/src/jit-test/tests/debug/Debugger-allowUnobservedAsmJS-02.js:21:1 Error: Assertion failed: got false, expected true
-Stack:
-  @$(SOURCE_DIR)/js/src/jit-test/tests/debug/Debugger-allowUnobservedAsmJS-02.js:21:1
-Exit code: 3
-FAIL - debug/Debugger-allowUnobservedAsmJS-02.js
-TEST-UNEXPECTED-FAIL | js/src/jit-test/tests/debug/Debugger-allowUnobservedAsmJS-02.js | $(SOURCE_DIR)/js/src/jit-test/tests/debug/Debugger-allowUnobservedAsmJS-02.js:21:1 Error: Assertion failed: got false, expected true (code 3, args "")
-INFO exit-status     : 3
-INFO timed-out       : False
-INFO stderr         2> $(SOURCE_DIR)/js/src/jit-test/tests/debug/Debugger-allowUnobservedAsmJS-02.js:21:1 Error: Assertion failed: got false, expected true
-INFO stderr         2> Stack:
-INFO stderr         2> @$(SOURCE_DIR)/js/src/jit-test/tests/debug/Debugger-allowUnobservedAsmJS-02.js:21:1
-$(SOURCE_DIR)/js/src/jit-test/tests/debug/Debugger-allowUnobservedAsmJS-02.js:21:1 Error: Assertion failed: got false, expected true
-Stack:
-  @$(SOURCE_DIR)/js/src/jit-test/tests/debug/Debugger-allowUnobservedAsmJS-02.js:21:1
-Exit code: 3
-FAIL - debug/Debugger-allowUnobservedAsmJS-02.js
-TEST-UNEXPECTED-FAIL | js/src/jit-test/tests/debug/Debugger-allowUnobservedAsmJS-02.js | $(SOURCE_DIR)/js/src/jit-test/tests/debug/Debugger-allowUnobservedAsmJS-02.js:21:1 Error: Assertion failed: got false, expected true (code 3, args "--ion-eager --ion-offthread-compile=off")
-INFO exit-status     : 3
-INFO timed-out       : False
-INFO stderr         2> $(SOURCE_DIR)/js/src/jit-test/tests/debug/Debugger-allowUnobservedAsmJS-02.js:21:1 Error: Assertion failed: got false, expected true
-INFO stderr         2> Stack:
-INFO stderr         2> @$(SOURCE_DIR)/js/src/jit-test/tests/debug/Debugger-allowUnobservedAsmJS-02.js:21:1
-$(SOURCE_DIR)/js/src/jit-test/tests/debug/Debugger-allowUnobservedAsmJS-02.js:21:1 Error: Assertion failed: got false, expected true
-Stack:
-  @$(SOURCE_DIR)/js/src/jit-test/tests/debug/Debugger-allowUnobservedAsmJS-02.js:21:1
-Exit code: 3
-FAIL - debug/Debugger-allowUnobservedAsmJS-02.js
-TEST-UNEXPECTED-FAIL | js/src/jit-test/tests/debug/Debugger-allowUnobservedAsmJS-02.js | $(SOURCE_DIR)/js/src/jit-test/tests/debug/Debugger-allowUnobservedAsmJS-02.js:21:1 Error: Assertion failed: got false, expected true (code 3, args "--baseline-eager")
-INFO exit-status     : 3
-INFO timed-out       : False
-INFO stderr         2> $(SOURCE_DIR)/js/src/jit-test/tests/debug/Debugger-allowUnobservedAsmJS-02.js:21:1 Error: Assertion failed: got false, expected true
-INFO stderr         2> Stack:
-INFO stderr         2> @$(SOURCE_DIR)/js/src/jit-test/tests/debug/Debugger-allowUnobservedAsmJS-02.js:21:1
-$(SOURCE_DIR)/js/src/jit-test/tests/debug/Debugger-allowUnobservedAsmJS-02.js:21:1 Error: Assertion failed: got false, expected true
-Stack:
-  @$(SOURCE_DIR)/js/src/jit-test/tests/debug/Debugger-allowUnobservedAsmJS-02.js:21:1
-Exit code: 3
-FAIL - debug/Debugger-allowUnobservedAsmJS-02.js
-TEST-UNEXPECTED-FAIL | js/src/jit-test/tests/debug/Debugger-allowUnobservedAsmJS-02.js | $(SOURCE_DIR)/js/src/jit-test/tests/debug/Debugger-allowUnobservedAsmJS-02.js:21:1 Error: Assertion failed: got false, expected true (code 3, args "--baseline-eager --no-fpu")
-INFO exit-status     : 3
-INFO timed-out       : False
-INFO stderr         2> $(SOURCE_DIR)/js/src/jit-test/tests/debug/Debugger-allowUnobservedAsmJS-02.js:21:1 Error: Assertion failed: got false, expected true
-INFO stderr         2> Stack:
-INFO stderr         2> @$(SOURCE_DIR)/js/src/jit-test/tests/debug/Debugger-allowUnobservedAsmJS-02.js:21:1
-$(SOURCE_DIR)/js/src/jit-test/tests/debug/Debugger-allowUnobservedAsmJS-02.js:21:1 Error: Assertion failed: got false, expected true
-Stack:
-  @$(SOURCE_DIR)/js/src/jit-test/tests/debug/Debugger-allowUnobservedAsmJS-02.js:21:1
-Exit code: 3
-FAIL - debug/Debugger-allowUnobservedAsmJS-02.js
-TEST-UNEXPECTED-FAIL | js/src/jit-test/tests/debug/Debugger-allowUnobservedAsmJS-02.js | $(SOURCE_DIR)/js/src/jit-test/tests/debug/Debugger-allowUnobservedAsmJS-02.js:21:1 Error: Assertion failed: got false, expected true (code 3, args "--no-baseline --no-ion")
-INFO exit-status     : 3
-INFO timed-out       : False
-INFO stderr         2> $(SOURCE_DIR)/js/src/jit-test/tests/debug/Debugger-allowUnobservedAsmJS-02.js:21:1 Error: Assertion failed: got false, expected true
-INFO stderr         2> Stack:
-INFO stderr         2> @$(SOURCE_DIR)/js/src/jit-test/tests/debug/Debugger-allowUnobservedAsmJS-02.js:21:1
-$(SOURCE_DIR)/js/src/jit-test/tests/ion/bug909997.js:31:5 Error: Assertion failed: got 0, expected 1
-Stack:
-  @$(SOURCE_DIR)/js/src/jit-test/tests/ion/bug909997.js:31:5
-Exit code: 3
-FAIL - ion/bug909997.js
-TEST-UNEXPECTED-FAIL | js/src/jit-test/tests/ion/bug909997.js | $(SOURCE_DIR)/js/src/jit-test/tests/ion/bug909997.js:31:5 Error: Assertion failed: got 0, expected 1 (code 3, args "")
-INFO exit-status     : 3
-INFO timed-out       : False
-INFO stderr         2> $(SOURCE_DIR)/js/src/jit-test/tests/ion/bug909997.js:31:5 Error: Assertion failed: got 0, expected 1
-INFO stderr         2> Stack:
-INFO stderr         2> @$(SOURCE_DIR)/js/src/jit-test/tests/ion/bug909997.js:31:5
-$(SOURCE_DIR)/js/src/jit-test/tests/ion/bug909997.js:31:5 Error: Assertion failed: got 0, expected 1
-Stack:
-  @$(SOURCE_DIR)/js/src/jit-test/tests/ion/bug909997.js:31:5
-Exit code: 3
-FAIL - ion/bug909997.js
-TEST-UNEXPECTED-FAIL | js/src/jit-test/tests/ion/bug909997.js | $(SOURCE_DIR)/js/src/jit-test/tests/ion/bug909997.js:31:5 Error: Assertion failed: got 0, expected 1 (code 3, args "--ion-eager --ion-offthread-compile=off")
-INFO exit-status     : 3
-INFO timed-out       : False
-INFO stderr         2> $(SOURCE_DIR)/js/src/jit-test/tests/ion/bug909997.js:31:5 Error: Assertion failed: got 0, expected 1
-INFO stderr         2> Stack:
-INFO stderr         2> @$(SOURCE_DIR)/js/src/jit-test/tests/ion/bug909997.js:31:5
-$(SOURCE_DIR)/js/src/jit-test/tests/ion/bug909997.js:31:5 Error: Assertion failed: got 0, expected 1
-Stack:
-  @$(SOURCE_DIR)/js/src/jit-test/tests/ion/bug909997.js:31:5
-Exit code: 3
-FAIL - ion/bug909997.js
-TEST-UNEXPECTED-FAIL | js/src/jit-test/tests/ion/bug909997.js | $(SOURCE_DIR)/js/src/jit-test/tests/ion/bug909997.js:31:5 Error: Assertion failed: got 0, expected 1 (code 3, args "--ion-eager --ion-offthread-compile=off --non-writable-jitcode --ion-check-range-analysis --ion-extra-checks --no-sse3 --no-threads")
-INFO exit-status     : 3
-INFO timed-out       : False
-INFO stderr         2> $(SOURCE_DIR)/js/src/jit-test/tests/ion/bug909997.js:31:5 Error: Assertion failed: got 0, expected 1
-INFO stderr         2> Stack:
-INFO stderr         2> @$(SOURCE_DIR)/js/src/jit-test/tests/ion/bug909997.js:31:5
-$(SOURCE_DIR)/js/src/jit-test/tests/ion/bug909997.js:31:5 Error: Assertion failed: got 0, expected 1
-Stack:
-  @$(SOURCE_DIR)/js/src/jit-test/tests/ion/bug909997.js:31:5
-Exit code: 3
-FAIL - ion/bug909997.js
-TEST-UNEXPECTED-FAIL | js/src/jit-test/tests/ion/bug909997.js | $(SOURCE_DIR)/js/src/jit-test/tests/ion/bug909997.js:31:5 Error: Assertion failed: got 0, expected 1 (code 3, args "--baseline-eager")
-INFO exit-status     : 3
-INFO timed-out       : False
-INFO stderr         2> $(SOURCE_DIR)/js/src/jit-test/tests/ion/bug909997.js:31:5 Error: Assertion failed: got 0, expected 1
-INFO stderr         2> Stack:
-INFO stderr         2> @$(SOURCE_DIR)/js/src/jit-test/tests/ion/bug909997.js:31:5
-$(SOURCE_DIR)/js/src/jit-test/tests/ion/bug909997.js:31:5 Error: Assertion failed: got 0, expected 1
-Stack:
-  @$(SOURCE_DIR)/js/src/jit-test/tests/ion/bug909997.js:31:5
-Exit code: 3
-FAIL - ion/bug909997.js
-TEST-UNEXPECTED-FAIL | js/src/jit-test/tests/ion/bug909997.js | $(SOURCE_DIR)/js/src/jit-test/tests/ion/bug909997.js:31:5 Error: Assertion failed: got 0, expected 1 (code 3, args "--baseline-eager --no-fpu")
-INFO exit-status     : 3
-INFO timed-out       : False
-INFO stderr         2> $(SOURCE_DIR)/js/src/jit-test/tests/ion/bug909997.js:31:5 Error: Assertion failed: got 0, expected 1
-INFO stderr         2> Stack:
-INFO stderr         2> @$(SOURCE_DIR)/js/src/jit-test/tests/ion/bug909997.js:31:5
-$(SOURCE_DIR)/js/src/jit-test/tests/ion/bug909997.js:31:5 Error: Assertion failed: got 0, expected 1
-Stack:
-  @$(SOURCE_DIR)/js/src/jit-test/tests/ion/bug909997.js:31:5
-Exit code: 3
-FAIL - ion/bug909997.js
-TEST-UNEXPECTED-FAIL | js/src/jit-test/tests/ion/bug909997.js | $(SOURCE_DIR)/js/src/jit-test/tests/ion/bug909997.js:31:5 Error: Assertion failed: got 0, expected 1 (code 3, args "--no-baseline --no-ion")
-INFO exit-status     : 3
-INFO timed-out       : False
-INFO stderr         2> $(SOURCE_DIR)/js/src/jit-test/tests/ion/bug909997.js:31:5 Error: Assertion failed: got 0, expected 1
-INFO stderr         2> Stack:
-INFO stderr         2> @$(SOURCE_DIR)/js/src/jit-test/tests/ion/bug909997.js:31:5
-FAILURES:
-    $(@D)/dist/bin/js -f $(SOURCE_DIR)/js/src/jit-test/lib/prologue.js --js-cache $(SOURCE_DIR)/js/src/jit-test/.js-cache -e "const platform='sunos5'; const libdir='$(SOURCE_DIR)/js/src/jit-test/lib/'; const scriptdir='$(SOURCE_DIR)/js/src/jit-test/tests/asm.js/'" -f $(SOURCE_DIR)/js/src/jit-test/tests/asm.js/testHeapAccess.js
-    $(@D)/dist/bin/js -f $(SOURCE_DIR)/js/src/jit-test/lib/prologue.js --js-cache $(SOURCE_DIR)/js/src/jit-test/.js-cache --ion-eager --ion-offthread-compile=off -e "const platform='sunos5'; const libdir='$(SOURCE_DIR)/js/src/jit-test/lib/'; const scriptdir='$(SOURCE_DIR)/js/src/jit-test/tests/asm.js/'" -f $(SOURCE_DIR)/js/src/jit-test/tests/asm.js/testHeapAccess.js
-    $(@D)/dist/bin/js -f $(SOURCE_DIR)/js/src/jit-test/lib/prologue.js --js-cache $(SOURCE_DIR)/js/src/jit-test/.js-cache --ion-extra-checks --non-writable-jitcode --ion-check-range-analysis --ion-offthread-compile=off --no-threads --ion-eager --no-sse3 -e "const platform='sunos5'; const libdir='$(SOURCE_DIR)/js/src/jit-test/lib/'; const scriptdir='$(SOURCE_DIR)/js/src/jit-test/tests/asm.js/'" -f $(SOURCE_DIR)/js/src/jit-test/tests/asm.js/testHeapAccess.js
-    $(@D)/dist/bin/js -f $(SOURCE_DIR)/js/src/jit-test/lib/prologue.js --js-cache $(SOURCE_DIR)/js/src/jit-test/.js-cache --baseline-eager -e "const platform='sunos5'; const libdir='$(SOURCE_DIR)/js/src/jit-test/lib/'; const scriptdir='$(SOURCE_DIR)/js/src/jit-test/tests/asm.js/'" -f $(SOURCE_DIR)/js/src/jit-test/tests/asm.js/testHeapAccess.js
-    $(@D)/dist/bin/js -f $(SOURCE_DIR)/js/src/jit-test/lib/prologue.js --js-cache $(SOURCE_DIR)/js/src/jit-test/.js-cache --baseline-eager --no-fpu -e "const platform='sunos5'; const libdir='$(SOURCE_DIR)/js/src/jit-test/lib/'; const scriptdir='$(SOURCE_DIR)/js/src/jit-test/tests/asm.js/'" -f $(SOURCE_DIR)/js/src/jit-test/tests/asm.js/testHeapAccess.js
-    $(@D)/dist/bin/js -f $(SOURCE_DIR)/js/src/jit-test/lib/prologue.js --js-cache $(SOURCE_DIR)/js/src/jit-test/.js-cache --no-baseline --no-ion -e "const platform='sunos5'; const libdir='$(SOURCE_DIR)/js/src/jit-test/lib/'; const scriptdir='$(SOURCE_DIR)/js/src/jit-test/tests/asm.js/'" -f $(SOURCE_DIR)/js/src/jit-test/tests/asm.js/testHeapAccess.js
-    $(@D)/dist/bin/js -f $(SOURCE_DIR)/js/src/jit-test/lib/prologue.js --js-cache $(SOURCE_DIR)/js/src/jit-test/.js-cache --no-asmjs -e "const platform='sunos5'; const libdir='$(SOURCE_DIR)/js/src/jit-test/lib/'; const scriptdir='$(SOURCE_DIR)/js/src/jit-test/tests/asm.js/'" -f $(SOURCE_DIR)/js/src/jit-test/tests/asm.js/testHeapAccess.js
-    $(@D)/dist/bin/js -f $(SOURCE_DIR)/js/src/jit-test/lib/prologue.js --js-cache $(SOURCE_DIR)/js/src/jit-test/.js-cache --code-coverage -e "const platform='sunos5'; const libdir='$(SOURCE_DIR)/js/src/jit-test/lib/'; const scriptdir='$(SOURCE_DIR)/js/src/jit-test/tests/coverage/'" -f $(SOURCE_DIR)/js/src/jit-test/tests/coverage/simple.js
-    $(@D)/dist/bin/js -f $(SOURCE_DIR)/js/src/jit-test/lib/prologue.js --js-cache $(SOURCE_DIR)/js/src/jit-test/.js-cache --ion-eager --ion-offthread-compile=off --code-coverage -e "const platform='sunos5'; const libdir='$(SOURCE_DIR)/js/src/jit-test/lib/'; const scriptdir='$(SOURCE_DIR)/js/src/jit-test/tests/coverage/'" -f $(SOURCE_DIR)/js/src/jit-test/tests/coverage/simple.js
-    $(@D)/dist/bin/js -f $(SOURCE_DIR)/js/src/jit-test/lib/prologue.js --js-cache $(SOURCE_DIR)/js/src/jit-test/.js-cache --ion-extra-checks --non-writable-jitcode --ion-check-range-analysis --ion-offthread-compile=off --no-threads --ion-eager --code-coverage --no-sse3 -e "const platform='sunos5'; const libdir='$(SOURCE_DIR)/js/src/jit-test/lib/'; const scriptdir='$(SOURCE_DIR)/js/src/jit-test/tests/coverage/'" -f $(SOURCE_DIR)/js/src/jit-test/tests/coverage/simple.js
-    $(@D)/dist/bin/js -f $(SOURCE_DIR)/js/src/jit-test/lib/prologue.js --js-cache $(SOURCE_DIR)/js/src/jit-test/.js-cache --baseline-eager --code-coverage -e "const platform='sunos5'; const libdir='$(SOURCE_DIR)/js/src/jit-test/lib/'; const scriptdir='$(SOURCE_DIR)/js/src/jit-test/tests/coverage/'" -f $(SOURCE_DIR)/js/src/jit-test/tests/coverage/simple.js
-    $(@D)/dist/bin/js -f $(SOURCE_DIR)/js/src/jit-test/lib/prologue.js --js-cache $(SOURCE_DIR)/js/src/jit-test/.js-cache --baseline-eager --no-fpu --code-coverage -e "const platform='sunos5'; const libdir='$(SOURCE_DIR)/js/src/jit-test/lib/'; const scriptdir='$(SOURCE_DIR)/js/src/jit-test/tests/coverage/'" -f $(SOURCE_DIR)/js/src/jit-test/tests/coverage/simple.js
-    $(@D)/dist/bin/js -f $(SOURCE_DIR)/js/src/jit-test/lib/prologue.js --js-cache $(SOURCE_DIR)/js/src/jit-test/.js-cache --no-baseline --no-ion --code-coverage -e "const platform='sunos5'; const libdir='$(SOURCE_DIR)/js/src/jit-test/lib/'; const scriptdir='$(SOURCE_DIR)/js/src/jit-test/tests/coverage/'" -f $(SOURCE_DIR)/js/src/jit-test/tests/coverage/simple.js
-    $(@D)/dist/bin/js -f $(SOURCE_DIR)/js/src/jit-test/lib/prologue.js --js-cache $(SOURCE_DIR)/js/src/jit-test/.js-cache -e "const platform='sunos5'; const libdir='$(SOURCE_DIR)/js/src/jit-test/lib/'; const scriptdir='$(SOURCE_DIR)/js/src/jit-test/tests/ctypes/'" -f $(SOURCE_DIR)/js/src/jit-test/tests/ctypes/conversion-native-function.js
-    $(@D)/dist/bin/js -f $(SOURCE_DIR)/js/src/jit-test/lib/prologue.js --js-cache $(SOURCE_DIR)/js/src/jit-test/.js-cache --ion-eager --ion-offthread-compile=off -e "const platform='sunos5'; const libdir='$(SOURCE_DIR)/js/src/jit-test/lib/'; const scriptdir='$(SOURCE_DIR)/js/src/jit-test/tests/ctypes/'" -f $(SOURCE_DIR)/js/src/jit-test/tests/ctypes/conversion-native-function.js
-    $(@D)/dist/bin/js -f $(SOURCE_DIR)/js/src/jit-test/lib/prologue.js --js-cache $(SOURCE_DIR)/js/src/jit-test/.js-cache --ion-extra-checks --non-writable-jitcode --ion-check-range-analysis --ion-offthread-compile=off --no-threads --ion-eager --no-sse3 -e "const platform='sunos5'; const libdir='$(SOURCE_DIR)/js/src/jit-test/lib/'; const scriptdir='$(SOURCE_DIR)/js/src/jit-test/tests/ctypes/'" -f $(SOURCE_DIR)/js/src/jit-test/tests/ctypes/conversion-native-function.js
-    $(@D)/dist/bin/js -f $(SOURCE_DIR)/js/src/jit-test/lib/prologue.js --js-cache $(SOURCE_DIR)/js/src/jit-test/.js-cache --baseline-eager -e "const platform='sunos5'; const libdir='$(SOURCE_DIR)/js/src/jit-test/lib/'; const scriptdir='$(SOURCE_DIR)/js/src/jit-test/tests/ctypes/'" -f $(SOURCE_DIR)/js/src/jit-test/tests/ctypes/conversion-native-function.js
-    $(@D)/dist/bin/js -f $(SOURCE_DIR)/js/src/jit-test/lib/prologue.js --js-cache $(SOURCE_DIR)/js/src/jit-test/.js-cache --baseline-eager --no-fpu -e "const platform='sunos5'; const libdir='$(SOURCE_DIR)/js/src/jit-test/lib/'; const scriptdir='$(SOURCE_DIR)/js/src/jit-test/tests/ctypes/'" -f $(SOURCE_DIR)/js/src/jit-test/tests/ctypes/conversion-native-function.js
-    $(@D)/dist/bin/js -f $(SOURCE_DIR)/js/src/jit-test/lib/prologue.js --js-cache $(SOURCE_DIR)/js/src/jit-test/.js-cache --no-baseline --no-ion -e "const platform='sunos5'; const libdir='$(SOURCE_DIR)/js/src/jit-test/lib/'; const scriptdir='$(SOURCE_DIR)/js/src/jit-test/tests/ctypes/'" -f $(SOURCE_DIR)/js/src/jit-test/tests/ctypes/conversion-native-function.js
-    $(@D)/dist/bin/js -f $(SOURCE_DIR)/js/src/jit-test/lib/prologue.js --js-cache $(SOURCE_DIR)/js/src/jit-test/.js-cache -e "const platform='sunos5'; const libdir='$(SOURCE_DIR)/js/src/jit-test/lib/'; const scriptdir='$(SOURCE_DIR)/js/src/jit-test/tests/debug/'" -f $(SOURCE_DIR)/js/src/jit-test/tests/debug/Debugger-allowUnobservedAsmJS-02.js
-    $(@D)/dist/bin/js -f $(SOURCE_DIR)/js/src/jit-test/lib/prologue.js --js-cache $(SOURCE_DIR)/js/src/jit-test/.js-cache --ion-eager --ion-offthread-compile=off -e "const platform='sunos5'; const libdir='$(SOURCE_DIR)/js/src/jit-test/lib/'; const scriptdir='$(SOURCE_DIR)/js/src/jit-test/tests/debug/'" -f $(SOURCE_DIR)/js/src/jit-test/tests/debug/Debugger-allowUnobservedAsmJS-02.js
-    $(@D)/dist/bin/js -f $(SOURCE_DIR)/js/src/jit-test/lib/prologue.js --js-cache $(SOURCE_DIR)/js/src/jit-test/.js-cache --baseline-eager -e "const platform='sunos5'; const libdir='$(SOURCE_DIR)/js/src/jit-test/lib/'; const scriptdir='$(SOURCE_DIR)/js/src/jit-test/tests/debug/'" -f $(SOURCE_DIR)/js/src/jit-test/tests/debug/Debugger-allowUnobservedAsmJS-02.js
-    $(@D)/dist/bin/js -f $(SOURCE_DIR)/js/src/jit-test/lib/prologue.js --js-cache $(SOURCE_DIR)/js/src/jit-test/.js-cache --baseline-eager --no-fpu -e "const platform='sunos5'; const libdir='$(SOURCE_DIR)/js/src/jit-test/lib/'; const scriptdir='$(SOURCE_DIR)/js/src/jit-test/tests/debug/'" -f $(SOURCE_DIR)/js/src/jit-test/tests/debug/Debugger-allowUnobservedAsmJS-02.js
-    $(@D)/dist/bin/js -f $(SOURCE_DIR)/js/src/jit-test/lib/prologue.js --js-cache $(SOURCE_DIR)/js/src/jit-test/.js-cache --no-baseline --no-ion -e "const platform='sunos5'; const libdir='$(SOURCE_DIR)/js/src/jit-test/lib/'; const scriptdir='$(SOURCE_DIR)/js/src/jit-test/tests/debug/'" -f $(SOURCE_DIR)/js/src/jit-test/tests/debug/Debugger-allowUnobservedAsmJS-02.js
-    $(@D)/dist/bin/js -f $(SOURCE_DIR)/js/src/jit-test/lib/prologue.js --js-cache $(SOURCE_DIR)/js/src/jit-test/.js-cache -e "const platform='sunos5'; const libdir='$(SOURCE_DIR)/js/src/jit-test/lib/'; const scriptdir='$(SOURCE_DIR)/js/src/jit-test/tests/ion/'" -f $(SOURCE_DIR)/js/src/jit-test/tests/ion/bug909997.js
-    $(@D)/dist/bin/js -f $(SOURCE_DIR)/js/src/jit-test/lib/prologue.js --js-cache $(SOURCE_DIR)/js/src/jit-test/.js-cache --ion-eager --ion-offthread-compile=off -e "const platform='sunos5'; const libdir='$(SOURCE_DIR)/js/src/jit-test/lib/'; const scriptdir='$(SOURCE_DIR)/js/src/jit-test/tests/ion/'" -f $(SOURCE_DIR)/js/src/jit-test/tests/ion/bug909997.js
-    $(@D)/dist/bin/js -f $(SOURCE_DIR)/js/src/jit-test/lib/prologue.js --js-cache $(SOURCE_DIR)/js/src/jit-test/.js-cache --ion-extra-checks --non-writable-jitcode --ion-check-range-analysis --ion-offthread-compile=off --no-threads --ion-eager --no-sse3 -e "const platform='sunos5'; const libdir='$(SOURCE_DIR)/js/src/jit-test/lib/'; const scriptdir='$(SOURCE_DIR)/js/src/jit-test/tests/ion/'" -f $(SOURCE_DIR)/js/src/jit-test/tests/ion/bug909997.js
-    $(@D)/dist/bin/js -f $(SOURCE_DIR)/js/src/jit-test/lib/prologue.js --js-cache $(SOURCE_DIR)/js/src/jit-test/.js-cache --baseline-eager -e "const platform='sunos5'; const libdir='$(SOURCE_DIR)/js/src/jit-test/lib/'; const scriptdir='$(SOURCE_DIR)/js/src/jit-test/tests/ion/'" -f $(SOURCE_DIR)/js/src/jit-test/tests/ion/bug909997.js
-    $(@D)/dist/bin/js -f $(SOURCE_DIR)/js/src/jit-test/lib/prologue.js --js-cache $(SOURCE_DIR)/js/src/jit-test/.js-cache --baseline-eager --no-fpu -e "const platform='sunos5'; const libdir='$(SOURCE_DIR)/js/src/jit-test/lib/'; const scriptdir='$(SOURCE_DIR)/js/src/jit-test/tests/ion/'" -f $(SOURCE_DIR)/js/src/jit-test/tests/ion/bug909997.js
-    $(@D)/dist/bin/js -f $(SOURCE_DIR)/js/src/jit-test/lib/prologue.js --js-cache $(SOURCE_DIR)/js/src/jit-test/.js-cache --no-baseline --no-ion -e "const platform='sunos5'; const libdir='$(SOURCE_DIR)/js/src/jit-test/lib/'; const scriptdir='$(SOURCE_DIR)/js/src/jit-test/tests/ion/'" -f $(SOURCE_DIR)/js/src/jit-test/tests/ion/bug909997.js
 TIMEOUTS:
 Result summary:
-Passed: 29651
+Passed: 29657
 Failed: 30
-make[1]: *** [Makefile:110: check-jit-test] Error 2
-make[1]: Leaving directory '$(@D)/js/src'