24836953 firefox/thunderbird js test failures
authorPetr Sumbera <petr.sumbera@oracle.com>
Wed, 12 Oct 2016 05:02:11 -0700
changeset 7099 58b579e0ff32
parent 7098 a46c4562925e
child 7102 64f95a1ef701
24836953 firefox/thunderbird js test failures
components/desktop/firefox/Makefile
components/desktop/firefox/patches/firefox-54-js-tests.patch
components/desktop/firefox/test/results-32.master
components/desktop/firefox/test/results-i386.master
components/desktop/firefox/test/results-sparc.master
components/desktop/thunderbird/Makefile
components/desktop/thunderbird/test/results-32.master
components/desktop/thunderbird/test/results-i386.master
components/desktop/thunderbird/test/results-sparc.master
--- a/components/desktop/firefox/Makefile	Thu Oct 13 03:01:51 2016 -0700
+++ b/components/desktop/firefox/Makefile	Wed Oct 12 05:02:11 2016 -0700
@@ -184,12 +184,10 @@
 	    LD_LIBRARY_PATH=$(PROTOUSRLIBDIR)/firefox-$(IPS_COMPONENT_VERSION) $(BUILD_DIR_32)/dist/bin/shlibsign -v -i $(PROTOUSRLIBDIR)/firefox-$(IPS_COMPONENT_VERSION)/$$f ; \
         done ;
 
-COMPONENT_TEST_MASTER = \
-        $(COMPONENT_TEST_RESULTS_DIR)/results-$(MACH).master
 COMPONENT_TEST_DIR =    $(@D)/js/src
 COMPONENT_TEST_TARGETS=check-jit-test
 COMPONENT_TEST_TRANSFORMS = \
-	'-e "/^TIMEOUTS:/,/Failed:/p" ' \
+	'-e "/^PASSED ALL/,/Failed:/p" ' \
 	'-e "/.*/d" '
 
 REQUIRED_PACKAGES += codec/libogg
--- /dev/null	Thu Jan 01 00:00:00 1970 +0000
+++ b/components/desktop/firefox/patches/firefox-54-js-tests.patch	Wed Oct 12 05:02:11 2016 -0700
@@ -0,0 +1,150 @@
+https://bugzilla.mozilla.org/show_bug.cgi?id=1308455
+https://bugzilla.mozilla.org/show_bug.cgi?id=1308897
+https://bugzilla.mozilla.org/show_bug.cgi?id=1309157
+https://bugzilla.mozilla.org/show_bug.cgi?id=1309246
+https://bugzilla.mozilla.org/show_bug.cgi?id=1233863
+
+--- a/js/src/jit-test/tests/asm.js/testHeapAccess.js
++++ b/js/src/jit-test/tests/asm.js/testHeapAccess.js
[email protected]@ -18,8 +18,20 @@
+ 
+ setCachingEnabled(true);
+ 
++// In order to allow following tests work on both big-endian and little-
++// endian architectures we need to define least significant byte (lsb) and
++// least significant word (lsw).
+ var code = asmCompile('glob', 'imp', 'b', USE_ASM + HEAP_IMPORTS + 'function f(i) {i=i|0; i32[0] = i; return i8[0]|0}; return f');
+ var f = asmLink(code, this, null, new ArrayBuffer(BUF_MIN));
++var lsb=0;
++var lsw=0
++if (f(0x12345678) == 0x12) {
++  lsb=3;
++  lsw=1;
++}
++
++var code = asmCompile('glob', 'imp', 'b', USE_ASM + HEAP_IMPORTS + 'function f(i) {i=i|0; i32[0] = i; return i8[' + lsb + ']|0}; return f');
++var f = asmLink(code, this, null, new ArrayBuffer(BUF_MIN));
+ assertEq(f(0),0);
+ assertEq(f(0x7f),0x7f);
+ assertEq(f(0xff),-1);
[email protected]@ -33,7 +45,7 @@
+         setJitCompilerOption("signals.enable", 0);
+ 
+         var buf = new ArrayBuffer(BUF_MIN);
+-        var code = asmCompile('glob', 'imp', 'b', USE_ASM + HEAP_IMPORTS + '/* not a clone */ function f(i) {i=i|0; i32[0] = i; return i8[0]|0}; return f');
++        var code = asmCompile('glob', 'imp', 'b', USE_ASM + HEAP_IMPORTS + '/* not a clone */ function f(i) {i=i|0; i32[0] = i; return i8[' + lsb + ']|0}; return f');
+         var f = asmLink(code, this, null, buf);
+         assertEq(f(0),0);
+         assertEq(f(0x7f),0x7f);
[email protected]@ -52,21 +64,21 @@
+ 
+ setCachingEnabled(false);
+ 
+-var code = asmCompile('glob', 'imp', 'b', USE_ASM + HEAP_IMPORTS + 'function f(i) {i=i|0; i32[0] = i; return u8[0]|0}; return f');
++var code = asmCompile('glob', 'imp', 'b', USE_ASM + HEAP_IMPORTS + 'function f(i) {i=i|0; i32[0] = i; return u8[' + lsb + ']|0}; return f');
+ var f = asmLink(code, this, null, new ArrayBuffer(BUF_MIN));
+ assertEq(f(0),0);
+ assertEq(f(0x7f),0x7f);
+ assertEq(f(0xff),0xff);
+ assertEq(f(0x100),0);
+ 
+-var code = asmCompile('glob', 'imp', 'b', USE_ASM + HEAP_IMPORTS + 'function f(i) {i=i|0; i32[0] = i; return i16[0]|0}; return f');
++var code = asmCompile('glob', 'imp', 'b', USE_ASM + HEAP_IMPORTS + 'function f(i) {i=i|0; i32[0] = i; return i16[' + lsw + ']|0}; return f');
+ var f = asmLink(code, this, null, new ArrayBuffer(BUF_MIN));
+ assertEq(f(0),0);
+ assertEq(f(0x7fff),0x7fff);
+ assertEq(f(0xffff),-1);
+ assertEq(f(0x10000),0);
+ 
+-var code = asmCompile('glob', 'imp', 'b', USE_ASM + HEAP_IMPORTS + 'function f(i) {i=i|0; i32[0] = i; return u16[0]|0}; return f');
++var code = asmCompile('glob', 'imp', 'b', USE_ASM + HEAP_IMPORTS + 'function f(i) {i=i|0; i32[0] = i; return u16[' + lsw + ']|0}; return f');
+ var f = asmLink(code, this, null, new ArrayBuffer(BUF_MIN));
+ assertEq(f(0),0);
+ assertEq(f(0x7fff),0x7fff);
[email protected]@ -87,14 +99,14 @@
+ assertEq(f(0xffffffff),-1);
+ assertEq(f(0x100000000),0);
+ 
+-var code = asmCompile('glob', 'imp', 'b', USE_ASM + HEAP_IMPORTS + 'function f(i) {i=i|0; i32[0] = i; return i8[0]|0}; return f');
++var code = asmCompile('glob', 'imp', 'b', USE_ASM + HEAP_IMPORTS + 'function f(i) {i=i|0; i32[0] = i; return i8[' + lsb + ']|0}; return f');
+ var f = asmLink(code, this, null, new ArrayBuffer(BUF_MIN));
+ assertEq(f(0),0);
+ assertEq(f(0x7f),0x7f);
+ assertEq(f(0xff),-1);
+ assertEq(f(0x100),0);
+ 
+-var code = asmCompile('glob', 'imp', 'b', USE_ASM + HEAP_IMPORTS + 'function f(i) {i=i|0; i32[0] = i; return u8[0]|0}; return f');
++var code = asmCompile('glob', 'imp', 'b', USE_ASM + HEAP_IMPORTS + 'function f(i) {i=i|0; i32[0] = i; return u8[' + lsb + ']|0}; return f');
+ var f = asmLink(code, this, null, new ArrayBuffer(BUF_MIN));
+ assertEq(f(0),0);
+ assertEq(f(0x7f),0x7f);
+--- a/js/src/vm/CodeCoverage.cpp
++++ b/js/src/vm/CodeCoverage.cpp
[email protected]@ -222,13 +222,13 @@
+             uint64_t taken = hits - fallthroughHits;
+             outBRDA_.printf("BRDA:%d,%d,0,", lineno, branchId);
+             if (taken)
+-                outBRDA_.printf("%d\n", taken);
++                outBRDA_.printf("%" PRIu64 "\n", taken);
+             else
+                 outBRDA_.put("-\n", 2);
+ 
+             outBRDA_.printf("BRDA:%d,%d,1,", lineno, branchId);
+             if (fallthroughHits)
+-                outBRDA_.printf("%d\n", fallthroughHits);
++                outBRDA_.printf("%" PRIu64 "\n", fallthroughHits);
+             else
+                 outBRDA_.put("-\n", 2);
+ 
[email protected]@ -301,7 +301,7 @@
+ 
+                     outBRDA_.printf("BRDA:%d,%d,%d,", lineno, branchId, i);
+                     if (caseHits)
+-                        outBRDA_.printf("%d\n", caseHits);
++                        outBRDA_.printf("%" PRIu64 "\n", caseHits);
+                     else
+                         outBRDA_.put("-\n", 2);
+ 
[email protected]@ -327,7 +327,7 @@
+ 
+             outBRDA_.printf("BRDA:%d,%d,%d,", lineno, branchId, numCases);
+             if (defaultHits)
+-                outBRDA_.printf("%d\n", defaultHits);
++                outBRDA_.printf("%" PRIu64 "\n", defaultHits);
+             else
+                 outBRDA_.put("-\n", 2);
+             numBranchesFound_++;
+--- a/js/src/jit-test/tests/ctypes/conversion-native-function.js
++++ b/js/src/jit-test/tests/ctypes/conversion-native-function.js
[email protected]@ -6,7 +6,7 @@
+ function test() {
+   let lib;
+   try {
+-    lib = ctypes.open(ctypes.libraryName("c"));
++    lib = ctypes.open(ctypes.libraryName("m"));
+   } catch (e) {
+   }
+   if (!lib)
+--- a/js/src/jit-test/tests/ion/bug909997.js
++++ b/js/src/jit-test/tests/ion/bug909997.js
[email protected]@ -1,3 +1,10 @@
++// getJitCompilerOptions will always return array with zeros when JIT is
++// disabled. Therefore we quit now.
++if (inJit() == 'Baseline is disabled.') {
++    print("JIT is disabled.");
++    quit();
++}
++
+ var wait = 100;
+ 
+ var method_A = function() {
+--- a/js/src/jit-test/tests/debug/Debugger-allowUnobservedAsmJS-02.js
++++ b/js/src/jit-test/tests/debug/Debugger-allowUnobservedAsmJS-02.js
[email protected]@ -19,5 +19,7 @@
+ 
+ var msg = getLastWarning().message;
+ assertEq(msg === "asm.js type error: Disabled by debugger" ||
++         msg === "asm.js type error: Disabled by lack of a JIT compiler" ||
++         msg === "asm.js type error: Disabled by javascript.options.asmjs in about:config" ||
+          msg === "asm.js type error: Disabled by lack of floating point support",
+          true);
--- /dev/null	Thu Jan 01 00:00:00 1970 +0000
+++ b/components/desktop/firefox/test/results-32.master	Wed Oct 12 05:02:11 2016 -0700
@@ -0,0 +1,4 @@
+PASSED ALL
+Result summary:
+Passed: 29687
+Failed: 0
--- a/components/desktop/firefox/test/results-i386.master	Thu Oct 13 03:01:51 2016 -0700
+++ /dev/null	Thu Jan 01 00:00:00 1970 +0000
@@ -1,4 +0,0 @@
-TIMEOUTS:
-Result summary:
-Passed: 29681
-Failed: 6
--- a/components/desktop/firefox/test/results-sparc.master	Thu Oct 13 03:01:51 2016 -0700
+++ /dev/null	Thu Jan 01 00:00:00 1970 +0000
@@ -1,4 +0,0 @@
-TIMEOUTS:
-Result summary:
-Passed: 29657
-Failed: 30
--- a/components/desktop/thunderbird/Makefile	Thu Oct 13 03:01:51 2016 -0700
+++ b/components/desktop/thunderbird/Makefile	Wed Oct 12 05:02:11 2016 -0700
@@ -225,12 +225,11 @@
 	    $(CP) $$f $(PROTOUSRLIBDIR)/thunderbird-$(COMPONENT_VERSION)/cpu/sparcv8plus/libnspr_flt4.so ; \
 	done ;
 
-COMPONENT_TEST_MASTER = \
-        $(COMPONENT_TEST_RESULTS_DIR)/results-$(MACH).master
 COMPONENT_TEST_DIR =    $(@D)/js/src
 COMPONENT_TEST_TARGETS=check-jit-test
-COMPONENT_TEST_TRANSFORMS += \
-        '-e "/\(^TEST-PASS\).*/d" '
+COMPONENT_TEST_TRANSFORMS = \
+	'-e "/^PASSED ALL/,/Failed:/p" ' \
+	'-e "/.*/d" '
 
 $(SOURCE_DIR)/.patched-firefox-%: GPATCH_FLAGS += -d $(@D)/mozilla
 
--- /dev/null	Thu Jan 01 00:00:00 1970 +0000
+++ b/components/desktop/thunderbird/test/results-32.master	Wed Oct 12 05:02:11 2016 -0700
@@ -0,0 +1,4 @@
+PASSED ALL
+Result summary:
+Passed: 29687
+Failed: 0
--- a/components/desktop/thunderbird/test/results-i386.master	Thu Oct 13 03:01:51 2016 -0700
+++ /dev/null	Thu Jan 01 00:00:00 1970 +0000
@@ -1,97 +0,0 @@
-make[1]: Entering directory '$(@D)/js/src'
-../../dist/bin/run-mozilla.sh $(@D)/_virtualenv/bin/python -u $(SOURCE_DIR)/mozilla/js/src/jit-test/jit_test.py \
-        --no-slow --no-progress --format=automation --jitflags=all -j 2 -f \
-		 \
-		 \
-        ../../dist/bin/js 
-$(SOURCE_DIR)/mozilla/js/src/jit-test/tests/ctypes/conversion-native-function.js:15:14 Error: couldn't find function symbol in library
-Stack:
-  [email protected]$(SOURCE_DIR)/mozilla/js/src/jit-test/tests/ctypes/conversion-native-function.js:15:14
-  @$(SOURCE_DIR)/mozilla/js/src/jit-test/tests/ctypes/conversion-native-function.js:37:3
-Exit code: 3
-FAIL - ctypes/conversion-native-function.js
-TEST-UNEXPECTED-FAIL | js/src/jit-test/tests/ctypes/conversion-native-function.js | $(SOURCE_DIR)/mozilla/js/src/jit-test/tests/ctypes/conversion-native-function.js:15:14 Error: couldn't find function symbol in library (code 3, args "")
-INFO exit-status     : 3
-INFO timed-out       : False
-INFO stderr         2> $(SOURCE_DIR)/mozilla/js/src/jit-test/tests/ctypes/conversion-native-function.js:15:14 Error: couldn't find function symbol in library
-INFO stderr         2> Stack:
-INFO stderr         2> [email protected]$(SOURCE_DIR)/mozilla/js/src/jit-test/tests/ctypes/conversion-native-function.js:15:14
-INFO stderr         2> @$(SOURCE_DIR)/mozilla/js/src/jit-test/tests/ctypes/conversion-native-function.js:37:3
-$(SOURCE_DIR)/mozilla/js/src/jit-test/tests/ctypes/conversion-native-function.js:15:14 Error: couldn't find function symbol in library
-Stack:
-  [email protected]$(SOURCE_DIR)/mozilla/js/src/jit-test/tests/ctypes/conversion-native-function.js:15:14
-  @$(SOURCE_DIR)/mozilla/js/src/jit-test/tests/ctypes/conversion-native-function.js:37:3
-Exit code: 3
-FAIL - ctypes/conversion-native-function.js
-TEST-UNEXPECTED-FAIL | js/src/jit-test/tests/ctypes/conversion-native-function.js | $(SOURCE_DIR)/mozilla/js/src/jit-test/tests/ctypes/conversion-native-function.js:15:14 Error: couldn't find function symbol in library (code 3, args "--ion-eager --ion-offthread-compile=off")
-INFO exit-status     : 3
-INFO timed-out       : False
-INFO stderr         2> $(SOURCE_DIR)/mozilla/js/src/jit-test/tests/ctypes/conversion-native-function.js:15:14 Error: couldn't find function symbol in library
-INFO stderr         2> Stack:
-INFO stderr         2> [email protected]$(SOURCE_DIR)/mozilla/js/src/jit-test/tests/ctypes/conversion-native-function.js:15:14
-INFO stderr         2> @$(SOURCE_DIR)/mozilla/js/src/jit-test/tests/ctypes/conversion-native-function.js:37:3
-$(SOURCE_DIR)/mozilla/js/src/jit-test/tests/ctypes/conversion-native-function.js:15:14 Error: couldn't find function symbol in library
-Stack:
-  [email protected]$(SOURCE_DIR)/mozilla/js/src/jit-test/tests/ctypes/conversion-native-function.js:15:14
-  @$(SOURCE_DIR)/mozilla/js/src/jit-test/tests/ctypes/conversion-native-function.js:37:3
-Exit code: 3
-FAIL - ctypes/conversion-native-function.js
-TEST-UNEXPECTED-FAIL | js/src/jit-test/tests/ctypes/conversion-native-function.js | $(SOURCE_DIR)/mozilla/js/src/jit-test/tests/ctypes/conversion-native-function.js:15:14 Error: couldn't find function symbol in library (code 3, args "--ion-eager --ion-offthread-compile=off --non-writable-jitcode --ion-check-range-analysis --ion-extra-checks --no-sse3 --no-threads")
-INFO exit-status     : 3
-INFO timed-out       : False
-INFO stderr         2> $(SOURCE_DIR)/mozilla/js/src/jit-test/tests/ctypes/conversion-native-function.js:15:14 Error: couldn't find function symbol in library
-INFO stderr         2> Stack:
-INFO stderr         2> [email protected]$(SOURCE_DIR)/mozilla/js/src/jit-test/tests/ctypes/conversion-native-function.js:15:14
-INFO stderr         2> @$(SOURCE_DIR)/mozilla/js/src/jit-test/tests/ctypes/conversion-native-function.js:37:3
-$(SOURCE_DIR)/mozilla/js/src/jit-test/tests/ctypes/conversion-native-function.js:15:14 Error: couldn't find function symbol in library
-Stack:
-  [email protected]$(SOURCE_DIR)/mozilla/js/src/jit-test/tests/ctypes/conversion-native-function.js:15:14
-  @$(SOURCE_DIR)/mozilla/js/src/jit-test/tests/ctypes/conversion-native-function.js:37:3
-Exit code: 3
-FAIL - ctypes/conversion-native-function.js
-TEST-UNEXPECTED-FAIL | js/src/jit-test/tests/ctypes/conversion-native-function.js | $(SOURCE_DIR)/mozilla/js/src/jit-test/tests/ctypes/conversion-native-function.js:15:14 Error: couldn't find function symbol in library (code 3, args "--baseline-eager")
-INFO exit-status     : 3
-INFO timed-out       : False
-INFO stderr         2> $(SOURCE_DIR)/mozilla/js/src/jit-test/tests/ctypes/conversion-native-function.js:15:14 Error: couldn't find function symbol in library
-INFO stderr         2> Stack:
-INFO stderr         2> [email protected]$(SOURCE_DIR)/mozilla/js/src/jit-test/tests/ctypes/conversion-native-function.js:15:14
-INFO stderr         2> @$(SOURCE_DIR)/mozilla/js/src/jit-test/tests/ctypes/conversion-native-function.js:37:3
-$(SOURCE_DIR)/mozilla/js/src/jit-test/tests/ctypes/conversion-native-function.js:15:14 Error: couldn't find function symbol in library
-Stack:
-  [email protected]$(SOURCE_DIR)/mozilla/js/src/jit-test/tests/ctypes/conversion-native-function.js:15:14
-  @$(SOURCE_DIR)/mozilla/js/src/jit-test/tests/ctypes/conversion-native-function.js:37:3
-Exit code: 3
-FAIL - ctypes/conversion-native-function.js
-TEST-UNEXPECTED-FAIL | js/src/jit-test/tests/ctypes/conversion-native-function.js | $(SOURCE_DIR)/mozilla/js/src/jit-test/tests/ctypes/conversion-native-function.js:15:14 Error: couldn't find function symbol in library (code 3, args "--baseline-eager --no-fpu")
-INFO exit-status     : 3
-INFO timed-out       : False
-INFO stderr         2> $(SOURCE_DIR)/mozilla/js/src/jit-test/tests/ctypes/conversion-native-function.js:15:14 Error: couldn't find function symbol in library
-INFO stderr         2> Stack:
-INFO stderr         2> [email protected]$(SOURCE_DIR)/mozilla/js/src/jit-test/tests/ctypes/conversion-native-function.js:15:14
-INFO stderr         2> @$(SOURCE_DIR)/mozilla/js/src/jit-test/tests/ctypes/conversion-native-function.js:37:3
-$(SOURCE_DIR)/mozilla/js/src/jit-test/tests/ctypes/conversion-native-function.js:15:14 Error: couldn't find function symbol in library
-Stack:
-  [email protected]$(SOURCE_DIR)/mozilla/js/src/jit-test/tests/ctypes/conversion-native-function.js:15:14
-  @$(SOURCE_DIR)/mozilla/js/src/jit-test/tests/ctypes/conversion-native-function.js:37:3
-Exit code: 3
-FAIL - ctypes/conversion-native-function.js
-TEST-UNEXPECTED-FAIL | js/src/jit-test/tests/ctypes/conversion-native-function.js | $(SOURCE_DIR)/mozilla/js/src/jit-test/tests/ctypes/conversion-native-function.js:15:14 Error: couldn't find function symbol in library (code 3, args "--no-baseline --no-ion")
-INFO exit-status     : 3
-INFO timed-out       : False
-INFO stderr         2> $(SOURCE_DIR)/mozilla/js/src/jit-test/tests/ctypes/conversion-native-function.js:15:14 Error: couldn't find function symbol in library
-INFO stderr         2> Stack:
-INFO stderr         2> [email protected]$(SOURCE_DIR)/mozilla/js/src/jit-test/tests/ctypes/conversion-native-function.js:15:14
-INFO stderr         2> @$(SOURCE_DIR)/mozilla/js/src/jit-test/tests/ctypes/conversion-native-function.js:37:3
-FAILURES:
-    $(@D)/dist/bin/js -f $(SOURCE_DIR)/mozilla/js/src/jit-test/lib/prologue.js --js-cache $(SOURCE_DIR)/mozilla/js/src/jit-test/.js-cache -e "const platform='sunos5'; const libdir='$(SOURCE_DIR)/mozilla/js/src/jit-test/lib/'; const scriptdir='$(SOURCE_DIR)/mozilla/js/src/jit-test/tests/ctypes/'" -f $(SOURCE_DIR)/mozilla/js/src/jit-test/tests/ctypes/conversion-native-function.js
-    $(@D)/dist/bin/js -f $(SOURCE_DIR)/mozilla/js/src/jit-test/lib/prologue.js --js-cache $(SOURCE_DIR)/mozilla/js/src/jit-test/.js-cache --ion-eager --ion-offthread-compile=off -e "const platform='sunos5'; const libdir='$(SOURCE_DIR)/mozilla/js/src/jit-test/lib/'; const scriptdir='$(SOURCE_DIR)/mozilla/js/src/jit-test/tests/ctypes/'" -f $(SOURCE_DIR)/mozilla/js/src/jit-test/tests/ctypes/conversion-native-function.js
-    $(@D)/dist/bin/js -f $(SOURCE_DIR)/mozilla/js/src/jit-test/lib/prologue.js --js-cache $(SOURCE_DIR)/mozilla/js/src/jit-test/.js-cache --ion-extra-checks --non-writable-jitcode --ion-check-range-analysis --ion-offthread-compile=off --no-threads --ion-eager --no-sse3 -e "const platform='sunos5'; const libdir='$(SOURCE_DIR)/mozilla/js/src/jit-test/lib/'; const scriptdir='$(SOURCE_DIR)/mozilla/js/src/jit-test/tests/ctypes/'" -f $(SOURCE_DIR)/mozilla/js/src/jit-test/tests/ctypes/conversion-native-function.js
-    $(@D)/dist/bin/js -f $(SOURCE_DIR)/mozilla/js/src/jit-test/lib/prologue.js --js-cache $(SOURCE_DIR)/mozilla/js/src/jit-test/.js-cache --baseline-eager -e "const platform='sunos5'; const libdir='$(SOURCE_DIR)/mozilla/js/src/jit-test/lib/'; const scriptdir='$(SOURCE_DIR)/mozilla/js/src/jit-test/tests/ctypes/'" -f $(SOURCE_DIR)/mozilla/js/src/jit-test/tests/ctypes/conversion-native-function.js
-    $(@D)/dist/bin/js -f $(SOURCE_DIR)/mozilla/js/src/jit-test/lib/prologue.js --js-cache $(SOURCE_DIR)/mozilla/js/src/jit-test/.js-cache --baseline-eager --no-fpu -e "const platform='sunos5'; const libdir='$(SOURCE_DIR)/mozilla/js/src/jit-test/lib/'; const scriptdir='$(SOURCE_DIR)/mozilla/js/src/jit-test/tests/ctypes/'" -f $(SOURCE_DIR)/mozilla/js/src/jit-test/tests/ctypes/conversion-native-function.js
-    $(@D)/dist/bin/js -f $(SOURCE_DIR)/mozilla/js/src/jit-test/lib/prologue.js --js-cache $(SOURCE_DIR)/mozilla/js/src/jit-test/.js-cache --no-baseline --no-ion -e "const platform='sunos5'; const libdir='$(SOURCE_DIR)/mozilla/js/src/jit-test/lib/'; const scriptdir='$(SOURCE_DIR)/mozilla/js/src/jit-test/tests/ctypes/'" -f $(SOURCE_DIR)/mozilla/js/src/jit-test/tests/ctypes/conversion-native-function.js
-TIMEOUTS:
-Result summary:
-Passed: 29681
-Failed: 6
-make[1]: *** [Makefile:110: check-jit-test] Error 2
-make[1]: Leaving directory '$(@D)/js/src'
--- a/components/desktop/thunderbird/test/results-sparc.master	Thu Oct 13 03:01:51 2016 -0700
+++ /dev/null	Thu Jan 01 00:00:00 1970 +0000
@@ -1,781 +0,0 @@
-make[1]: Entering directory '$(@D)/js/src'
-../../dist/bin/run-mozilla.sh $(@D)/_virtualenv/bin/python -u $(SOURCE_DIR)/mozilla/js/src/jit-test/jit_test.py \
-        --no-slow --no-progress --format=automation --jitflags=all -j 2 -f \
-		 \
-		 \
-        ../../dist/bin/js 
-$(SOURCE_DIR)/mozilla/js/src/jit-test/tests/asm.js/testHeapAccess.js:24:1 Error: Assertion failed: got 0, expected 127
-Stack:
-  @$(SOURCE_DIR)/mozilla/js/src/jit-test/tests/asm.js/testHeapAccess.js:24:1
-Exit code: 3
-FAIL - asm.js/testHeapAccess.js
-TEST-UNEXPECTED-FAIL | js/src/jit-test/tests/asm.js/testHeapAccess.js | $(SOURCE_DIR)/mozilla/js/src/jit-test/tests/asm.js/testHeapAccess.js:24:1 Error: Assertion failed: got 0, expected 127 (code 3, args "")
-INFO exit-status     : 3
-INFO timed-out       : False
-INFO stderr         2> $(SOURCE_DIR)/mozilla/js/src/jit-test/tests/asm.js/testHeapAccess.js:24:1 Error: Assertion failed: got 0, expected 127
-INFO stderr         2> Stack:
-INFO stderr         2> @$(SOURCE_DIR)/mozilla/js/src/jit-test/tests/asm.js/testHeapAccess.js:24:1
-$(SOURCE_DIR)/mozilla/js/src/jit-test/tests/asm.js/testHeapAccess.js:24:1 Error: Assertion failed: got 0, expected 127
-Stack:
-  @$(SOURCE_DIR)/mozilla/js/src/jit-test/tests/asm.js/testHeapAccess.js:24:1
-Exit code: 3
-FAIL - asm.js/testHeapAccess.js
-TEST-UNEXPECTED-FAIL | js/src/jit-test/tests/asm.js/testHeapAccess.js | $(SOURCE_DIR)/mozilla/js/src/jit-test/tests/asm.js/testHeapAccess.js:24:1 Error: Assertion failed: got 0, expected 127 (code 3, args "--ion-eager --ion-offthread-compile=off --non-writable-jitcode --ion-check-range-analysis --ion-extra-checks --no-sse3 --no-threads")
-INFO exit-status     : 3
-INFO timed-out       : False
-INFO stderr         2> $(SOURCE_DIR)/mozilla/js/src/jit-test/tests/asm.js/testHeapAccess.js:24:1 Error: Assertion failed: got 0, expected 127
-INFO stderr         2> Stack:
-INFO stderr         2> @$(SOURCE_DIR)/mozilla/js/src/jit-test/tests/asm.js/testHeapAccess.js:24:1
-$(SOURCE_DIR)/mozilla/js/src/jit-test/tests/asm.js/testHeapAccess.js:24:1 Error: Assertion failed: got 0, expected 127
-Stack:
-  @$(SOURCE_DIR)/mozilla/js/src/jit-test/tests/asm.js/testHeapAccess.js:24:1
-Exit code: 3
-FAIL - asm.js/testHeapAccess.js
-TEST-UNEXPECTED-FAIL | js/src/jit-test/tests/asm.js/testHeapAccess.js | $(SOURCE_DIR)/mozilla/js/src/jit-test/tests/asm.js/testHeapAccess.js:24:1 Error: Assertion failed: got 0, expected 127 (code 3, args "--ion-eager --ion-offthread-compile=off")
-INFO exit-status     : 3
-INFO timed-out       : False
-INFO stderr         2> $(SOURCE_DIR)/mozilla/js/src/jit-test/tests/asm.js/testHeapAccess.js:24:1 Error: Assertion failed: got 0, expected 127
-INFO stderr         2> Stack:
-INFO stderr         2> @$(SOURCE_DIR)/mozilla/js/src/jit-test/tests/asm.js/testHeapAccess.js:24:1
-$(SOURCE_DIR)/mozilla/js/src/jit-test/tests/asm.js/testHeapAccess.js:24:1 Error: Assertion failed: got 0, expected 127
-Stack:
-  @$(SOURCE_DIR)/mozilla/js/src/jit-test/tests/asm.js/testHeapAccess.js:24:1
-Exit code: 3
-FAIL - asm.js/testHeapAccess.js
-TEST-UNEXPECTED-FAIL | js/src/jit-test/tests/asm.js/testHeapAccess.js | $(SOURCE_DIR)/mozilla/js/src/jit-test/tests/asm.js/testHeapAccess.js:24:1 Error: Assertion failed: got 0, expected 127 (code 3, args "--baseline-eager")
-INFO exit-status     : 3
-INFO timed-out       : False
-INFO stderr         2> $(SOURCE_DIR)/mozilla/js/src/jit-test/tests/asm.js/testHeapAccess.js:24:1 Error: Assertion failed: got 0, expected 127
-INFO stderr         2> Stack:
-INFO stderr         2> @$(SOURCE_DIR)/mozilla/js/src/jit-test/tests/asm.js/testHeapAccess.js:24:1
-$(SOURCE_DIR)/mozilla/js/src/jit-test/tests/asm.js/testHeapAccess.js:24:1 Error: Assertion failed: got 0, expected 127
-Stack:
-  @$(SOURCE_DIR)/mozilla/js/src/jit-test/tests/asm.js/testHeapAccess.js:24:1
-Exit code: 3
-FAIL - asm.js/testHeapAccess.js
-TEST-UNEXPECTED-FAIL | js/src/jit-test/tests/asm.js/testHeapAccess.js | $(SOURCE_DIR)/mozilla/js/src/jit-test/tests/asm.js/testHeapAccess.js:24:1 Error: Assertion failed: got 0, expected 127 (code 3, args "--baseline-eager --no-fpu")
-INFO exit-status     : 3
-INFO timed-out       : False
-INFO stderr         2> $(SOURCE_DIR)/mozilla/js/src/jit-test/tests/asm.js/testHeapAccess.js:24:1 Error: Assertion failed: got 0, expected 127
-INFO stderr         2> Stack:
-INFO stderr         2> @$(SOURCE_DIR)/mozilla/js/src/jit-test/tests/asm.js/testHeapAccess.js:24:1
-$(SOURCE_DIR)/mozilla/js/src/jit-test/tests/asm.js/testHeapAccess.js:24:1 Error: Assertion failed: got 0, expected 127
-Stack:
-  @$(SOURCE_DIR)/mozilla/js/src/jit-test/tests/asm.js/testHeapAccess.js:24:1
-Exit code: 3
-FAIL - asm.js/testHeapAccess.js
-TEST-UNEXPECTED-FAIL | js/src/jit-test/tests/asm.js/testHeapAccess.js | $(SOURCE_DIR)/mozilla/js/src/jit-test/tests/asm.js/testHeapAccess.js:24:1 Error: Assertion failed: got 0, expected 127 (code 3, args "--no-baseline --no-ion")
-INFO exit-status     : 3
-INFO timed-out       : False
-INFO stderr         2> $(SOURCE_DIR)/mozilla/js/src/jit-test/tests/asm.js/testHeapAccess.js:24:1 Error: Assertion failed: got 0, expected 127
-INFO stderr         2> Stack:
-INFO stderr         2> @$(SOURCE_DIR)/mozilla/js/src/jit-test/tests/asm.js/testHeapAccess.js:24:1
-$(SOURCE_DIR)/mozilla/js/src/jit-test/tests/asm.js/testHeapAccess.js:24:1 Error: Assertion failed: got 0, expected 127
-Stack:
-  @$(SOURCE_DIR)/mozilla/js/src/jit-test/tests/asm.js/testHeapAccess.js:24:1
-Exit code: 3
-FAIL - asm.js/testHeapAccess.js
-TEST-UNEXPECTED-FAIL | js/src/jit-test/tests/asm.js/testHeapAccess.js | $(SOURCE_DIR)/mozilla/js/src/jit-test/tests/asm.js/testHeapAccess.js:24:1 Error: Assertion failed: got 0, expected 127 (code 3, args "--no-asmjs")
-INFO exit-status     : 3
-INFO timed-out       : False
-INFO stderr         2> $(SOURCE_DIR)/mozilla/js/src/jit-test/tests/asm.js/testHeapAccess.js:24:1 Error: Assertion failed: got 0, expected 127
-INFO stderr         2> Stack:
-INFO stderr         2> @$(SOURCE_DIR)/mozilla/js/src/jit-test/tests/asm.js/testHeapAccess.js:24:1
-Cannot find `BRDA:3,0,0,1` in the following Lcov result:
- TN:Compartment_5fd1ebdc00
-SF:$(SOURCE_DIR)/mozilla/js/src/jit-test/tests/coverage/simple.js line 60 > eval
-FN:1,top-level
-FNDA:1,top-level
-FNF:1
-FNH:1
-BRDA:3,0,0,0
-BRDA:3,0,1,-
-BRF:2
-BRH:1
-DA:2,1
-DA:3,1
-DA:4,0
-DA:5,1
-LF:4
-LH:3
-end_of_record
-
-In the following source:
-  //FN:$,top-level //FNDA:1,%
-  var l = ",".split(','); //DA:$,1
-  if (l.length == 3)      //DA:$,1 //BRDA:$,0,0,1 //BRDA:$,0,1,-
-    l.push('');           //DA:$,0
-  l.pop();                //DA:$,1
-  //FNF:1
-  //FNH:1
-  //LF:4
-  //LH:3
-  //BRF:2
-  //BRH:1
-
-$(SOURCE_DIR)/mozilla/js/src/jit-test/tests/coverage/simple.js:69:7 Error: Assertion failed: got true, expected false
-Stack:
-  [email protected]$(SOURCE_DIR)/mozilla/js/src/jit-test/tests/coverage/simple.js:69:7
-  @$(SOURCE_DIR)/mozilla/js/src/jit-test/tests/coverage/simple.js:104:1
-Exit code: 3
-FAIL - coverage/simple.js
-TEST-UNEXPECTED-FAIL | js/src/jit-test/tests/coverage/simple.js | $(SOURCE_DIR)/mozilla/js/src/jit-test/tests/coverage/simple.js:69:7 Error: Assertion failed: got true, expected false (code 3, args "--code-coverage")
-INFO exit-status     : 3
-INFO timed-out       : False
-INFO stdout          > Cannot find `BRDA:3,0,0,1` in the following Lcov result:
-INFO stdout          > TN:Compartment_5fd1ebdc00
-INFO stdout          > SF:$(SOURCE_DIR)/mozilla/js/src/jit-test/tests/coverage/simple.js line 60 > eval
-INFO stdout          > FN:1,top-level
-INFO stdout          > FNDA:1,top-level
-INFO stdout          > FNF:1
-INFO stdout          > FNH:1
-INFO stdout          > BRDA:3,0,0,0
-INFO stdout          > BRDA:3,0,1,-
-INFO stdout          > BRF:2
-INFO stdout          > BRH:1
-INFO stdout          > DA:2,1
-INFO stdout          > DA:3,1
-INFO stdout          > DA:4,0
-INFO stdout          > DA:5,1
-INFO stdout          > LF:4
-INFO stdout          > LH:3
-INFO stdout          > end_of_record
-INFO stdout          > 
-INFO stdout          > In the following source:
-INFO stdout          > //FN:$,top-level //FNDA:1,%
-INFO stdout          > var l = ",".split(','); //DA:$,1
-INFO stdout          > if (l.length == 3)      //DA:$,1 //BRDA:$,0,0,1 //BRDA:$,0,1,-
-INFO stdout          > l.push('');           //DA:$,0
-INFO stdout          > l.pop();                //DA:$,1
-INFO stdout          > //FNF:1
-INFO stdout          > //FNH:1
-INFO stdout          > //LF:4
-INFO stdout          > //LH:3
-INFO stdout          > //BRF:2
-INFO stdout          > //BRH:1
-INFO stdout          > 
-INFO stderr         2> $(SOURCE_DIR)/mozilla/js/src/jit-test/tests/coverage/simple.js:69:7 Error: Assertion failed: got true, expected false
-INFO stderr         2> Stack:
-INFO stderr         2> [email protected]$(SOURCE_DIR)/mozilla/js/src/jit-test/tests/coverage/simple.js:69:7
-INFO stderr         2> @$(SOURCE_DIR)/mozilla/js/src/jit-test/tests/coverage/simple.js:104:1
-Cannot find `BRDA:3,0,0,1` in the following Lcov result:
- TN:Compartment_5fcccbdc00
-SF:$(SOURCE_DIR)/mozilla/js/src/jit-test/tests/coverage/simple.js line 60 > eval
-FN:1,top-level
-FNDA:1,top-level
-FNF:1
-FNH:1
-BRDA:3,0,0,0
-BRDA:3,0,1,-
-BRF:2
-BRH:1
-DA:2,1
-DA:3,1
-DA:4,0
-DA:5,1
-LF:4
-LH:3
-end_of_record
-
-In the following source:
-  //FN:$,top-level //FNDA:1,%
-  var l = ",".split(','); //DA:$,1
-  if (l.length == 3)      //DA:$,1 //BRDA:$,0,0,1 //BRDA:$,0,1,-
-    l.push('');           //DA:$,0
-  l.pop();                //DA:$,1
-  //FNF:1
-  //FNH:1
-  //LF:4
-  //LH:3
-  //BRF:2
-  //BRH:1
-
-$(SOURCE_DIR)/mozilla/js/src/jit-test/tests/coverage/simple.js:69:7 Error: Assertion failed: got true, expected false
-Stack:
-  [email protected]$(SOURCE_DIR)/mozilla/js/src/jit-test/tests/coverage/simple.js:69:7
-  @$(SOURCE_DIR)/mozilla/js/src/jit-test/tests/coverage/simple.js:104:1
-Exit code: 3
-FAIL - coverage/simple.js
-TEST-UNEXPECTED-FAIL | js/src/jit-test/tests/coverage/simple.js | $(SOURCE_DIR)/mozilla/js/src/jit-test/tests/coverage/simple.js:69:7 Error: Assertion failed: got true, expected false (code 3, args "--code-coverage --ion-eager --ion-offthread-compile=off")
-INFO exit-status     : 3
-INFO timed-out       : False
-INFO stdout          > Cannot find `BRDA:3,0,0,1` in the following Lcov result:
-INFO stdout          > TN:Compartment_5fcccbdc00
-INFO stdout          > SF:$(SOURCE_DIR)/mozilla/js/src/jit-test/tests/coverage/simple.js line 60 > eval
-INFO stdout          > FN:1,top-level
-INFO stdout          > FNDA:1,top-level
-INFO stdout          > FNF:1
-INFO stdout          > FNH:1
-INFO stdout          > BRDA:3,0,0,0
-INFO stdout          > BRDA:3,0,1,-
-INFO stdout          > BRF:2
-INFO stdout          > BRH:1
-INFO stdout          > DA:2,1
-INFO stdout          > DA:3,1
-INFO stdout          > DA:4,0
-INFO stdout          > DA:5,1
-INFO stdout          > LF:4
-INFO stdout          > LH:3
-INFO stdout          > end_of_record
-INFO stdout          > 
-INFO stdout          > In the following source:
-INFO stdout          > //FN:$,top-level //FNDA:1,%
-INFO stdout          > var l = ",".split(','); //DA:$,1
-INFO stdout          > if (l.length == 3)      //DA:$,1 //BRDA:$,0,0,1 //BRDA:$,0,1,-
-INFO stdout          > l.push('');           //DA:$,0
-INFO stdout          > l.pop();                //DA:$,1
-INFO stdout          > //FNF:1
-INFO stdout          > //FNH:1
-INFO stdout          > //LF:4
-INFO stdout          > //LH:3
-INFO stdout          > //BRF:2
-INFO stdout          > //BRH:1
-INFO stdout          > 
-INFO stderr         2> $(SOURCE_DIR)/mozilla/js/src/jit-test/tests/coverage/simple.js:69:7 Error: Assertion failed: got true, expected false
-INFO stderr         2> Stack:
-INFO stderr         2> [email protected]$(SOURCE_DIR)/mozilla/js/src/jit-test/tests/coverage/simple.js:69:7
-INFO stderr         2> @$(SOURCE_DIR)/mozilla/js/src/jit-test/tests/coverage/simple.js:104:1
-Cannot find `BRDA:3,0,0,1` in the following Lcov result:
- TN:Compartment_5fed207c00
-SF:$(SOURCE_DIR)/mozilla/js/src/jit-test/tests/coverage/simple.js line 60 > eval
-FN:1,top-level
-FNDA:1,top-level
-FNF:1
-FNH:1
-BRDA:3,0,0,0
-BRDA:3,0,1,-
-BRF:2
-BRH:1
-DA:2,1
-DA:3,1
-DA:4,0
-DA:5,1
-LF:4
-LH:3
-end_of_record
-
-In the following source:
-  //FN:$,top-level //FNDA:1,%
-  var l = ",".split(','); //DA:$,1
-  if (l.length == 3)      //DA:$,1 //BRDA:$,0,0,1 //BRDA:$,0,1,-
-    l.push('');           //DA:$,0
-  l.pop();                //DA:$,1
-  //FNF:1
-  //FNH:1
-  //LF:4
-  //LH:3
-  //BRF:2
-  //BRH:1
-
-$(SOURCE_DIR)/mozilla/js/src/jit-test/tests/coverage/simple.js:69:7 Error: Assertion failed: got true, expected false
-Stack:
-  [email protected]$(SOURCE_DIR)/mozilla/js/src/jit-test/tests/coverage/simple.js:69:7
-  @$(SOURCE_DIR)/mozilla/js/src/jit-test/tests/coverage/simple.js:104:1
-Exit code: 3
-FAIL - coverage/simple.js
-TEST-UNEXPECTED-FAIL | js/src/jit-test/tests/coverage/simple.js | $(SOURCE_DIR)/mozilla/js/src/jit-test/tests/coverage/simple.js:69:7 Error: Assertion failed: got true, expected false (code 3, args "--code-coverage --ion-eager --ion-offthread-compile=off --non-writable-jitcode --ion-check-range-analysis --ion-extra-checks --no-sse3 --no-threads")
-INFO exit-status     : 3
-INFO timed-out       : False
-INFO stdout          > Cannot find `BRDA:3,0,0,1` in the following Lcov result:
-INFO stdout          > TN:Compartment_5fed207c00
-INFO stdout          > SF:$(SOURCE_DIR)/mozilla/js/src/jit-test/tests/coverage/simple.js line 60 > eval
-INFO stdout          > FN:1,top-level
-INFO stdout          > FNDA:1,top-level
-INFO stdout          > FNF:1
-INFO stdout          > FNH:1
-INFO stdout          > BRDA:3,0,0,0
-INFO stdout          > BRDA:3,0,1,-
-INFO stdout          > BRF:2
-INFO stdout          > BRH:1
-INFO stdout          > DA:2,1
-INFO stdout          > DA:3,1
-INFO stdout          > DA:4,0
-INFO stdout          > DA:5,1
-INFO stdout          > LF:4
-INFO stdout          > LH:3
-INFO stdout          > end_of_record
-INFO stdout          > 
-INFO stdout          > In the following source:
-INFO stdout          > //FN:$,top-level //FNDA:1,%
-INFO stdout          > var l = ",".split(','); //DA:$,1
-INFO stdout          > if (l.length == 3)      //DA:$,1 //BRDA:$,0,0,1 //BRDA:$,0,1,-
-INFO stdout          > l.push('');           //DA:$,0
-INFO stdout          > l.pop();                //DA:$,1
-INFO stdout          > //FNF:1
-INFO stdout          > //FNH:1
-INFO stdout          > //LF:4
-INFO stdout          > //LH:3
-INFO stdout          > //BRF:2
-INFO stdout          > //BRH:1
-INFO stdout          > 
-INFO stderr         2> $(SOURCE_DIR)/mozilla/js/src/jit-test/tests/coverage/simple.js:69:7 Error: Assertion failed: got true, expected false
-INFO stderr         2> Stack:
-INFO stderr         2> [email protected]$(SOURCE_DIR)/mozilla/js/src/jit-test/tests/coverage/simple.js:69:7
-INFO stderr         2> @$(SOURCE_DIR)/mozilla/js/src/jit-test/tests/coverage/simple.js:104:1
-Cannot find `BRDA:3,0,0,1` in the following Lcov result:
- TN:Compartment_5fcfabdc00
-SF:$(SOURCE_DIR)/mozilla/js/src/jit-test/tests/coverage/simple.js line 60 > eval
-FN:1,top-level
-FNDA:1,top-level
-FNF:1
-FNH:1
-BRDA:3,0,0,0
-BRDA:3,0,1,-
-BRF:2
-BRH:1
-DA:2,1
-DA:3,1
-DA:4,0
-DA:5,1
-LF:4
-LH:3
-end_of_record
-
-In the following source:
-  //FN:$,top-level //FNDA:1,%
-  var l = ",".split(','); //DA:$,1
-  if (l.length == 3)      //DA:$,1 //BRDA:$,0,0,1 //BRDA:$,0,1,-
-    l.push('');           //DA:$,0
-  l.pop();                //DA:$,1
-  //FNF:1
-  //FNH:1
-  //LF:4
-  //LH:3
-  //BRF:2
-  //BRH:1
-
-$(SOURCE_DIR)/mozilla/js/src/jit-test/tests/coverage/simple.js:69:7 Error: Assertion failed: got true, expected false
-Stack:
-  [email protected]$(SOURCE_DIR)/mozilla/js/src/jit-test/tests/coverage/simple.js:69:7
-  @$(SOURCE_DIR)/mozilla/js/src/jit-test/tests/coverage/simple.js:104:1
-Exit code: 3
-FAIL - coverage/simple.js
-TEST-UNEXPECTED-FAIL | js/src/jit-test/tests/coverage/simple.js | $(SOURCE_DIR)/mozilla/js/src/jit-test/tests/coverage/simple.js:69:7 Error: Assertion failed: got true, expected false (code 3, args "--code-coverage --baseline-eager")
-INFO exit-status     : 3
-INFO timed-out       : False
-INFO stdout          > Cannot find `BRDA:3,0,0,1` in the following Lcov result:
-INFO stdout          > TN:Compartment_5fcfabdc00
-INFO stdout          > SF:$(SOURCE_DIR)/mozilla/js/src/jit-test/tests/coverage/simple.js line 60 > eval
-INFO stdout          > FN:1,top-level
-INFO stdout          > FNDA:1,top-level
-INFO stdout          > FNF:1
-INFO stdout          > FNH:1
-INFO stdout          > BRDA:3,0,0,0
-INFO stdout          > BRDA:3,0,1,-
-INFO stdout          > BRF:2
-INFO stdout          > BRH:1
-INFO stdout          > DA:2,1
-INFO stdout          > DA:3,1
-INFO stdout          > DA:4,0
-INFO stdout          > DA:5,1
-INFO stdout          > LF:4
-INFO stdout          > LH:3
-INFO stdout          > end_of_record
-INFO stdout          > 
-INFO stdout          > In the following source:
-INFO stdout          > //FN:$,top-level //FNDA:1,%
-INFO stdout          > var l = ",".split(','); //DA:$,1
-INFO stdout          > if (l.length == 3)      //DA:$,1 //BRDA:$,0,0,1 //BRDA:$,0,1,-
-INFO stdout          > l.push('');           //DA:$,0
-INFO stdout          > l.pop();                //DA:$,1
-INFO stdout          > //FNF:1
-INFO stdout          > //FNH:1
-INFO stdout          > //LF:4
-INFO stdout          > //LH:3
-INFO stdout          > //BRF:2
-INFO stdout          > //BRH:1
-INFO stdout          > 
-INFO stderr         2> $(SOURCE_DIR)/mozilla/js/src/jit-test/tests/coverage/simple.js:69:7 Error: Assertion failed: got true, expected false
-INFO stderr         2> Stack:
-INFO stderr         2> [email protected]$(SOURCE_DIR)/mozilla/js/src/jit-test/tests/coverage/simple.js:69:7
-INFO stderr         2> @$(SOURCE_DIR)/mozilla/js/src/jit-test/tests/coverage/simple.js:104:1
-Cannot find `BRDA:3,0,0,1` in the following Lcov result:
- TN:Compartment_5fcbebdc00
-SF:$(SOURCE_DIR)/mozilla/js/src/jit-test/tests/coverage/simple.js line 60 > eval
-FN:1,top-level
-FNDA:1,top-level
-FNF:1
-FNH:1
-BRDA:3,0,0,0
-BRDA:3,0,1,-
-BRF:2
-BRH:1
-DA:2,1
-DA:3,1
-DA:4,0
-DA:5,1
-LF:4
-LH:3
-end_of_record
-
-In the following source:
-  //FN:$,top-level //FNDA:1,%
-  var l = ",".split(','); //DA:$,1
-  if (l.length == 3)      //DA:$,1 //BRDA:$,0,0,1 //BRDA:$,0,1,-
-    l.push('');           //DA:$,0
-  l.pop();                //DA:$,1
-  //FNF:1
-  //FNH:1
-  //LF:4
-  //LH:3
-  //BRF:2
-  //BRH:1
-
-$(SOURCE_DIR)/mozilla/js/src/jit-test/tests/coverage/simple.js:69:7 Error: Assertion failed: got true, expected false
-Stack:
-  [email protected]$(SOURCE_DIR)/mozilla/js/src/jit-test/tests/coverage/simple.js:69:7
-  @$(SOURCE_DIR)/mozilla/js/src/jit-test/tests/coverage/simple.js:104:1
-Exit code: 3
-FAIL - coverage/simple.js
-TEST-UNEXPECTED-FAIL | js/src/jit-test/tests/coverage/simple.js | $(SOURCE_DIR)/mozilla/js/src/jit-test/tests/coverage/simple.js:69:7 Error: Assertion failed: got true, expected false (code 3, args "--code-coverage --baseline-eager --no-fpu")
-INFO exit-status     : 3
-INFO timed-out       : False
-INFO stdout          > Cannot find `BRDA:3,0,0,1` in the following Lcov result:
-INFO stdout          > TN:Compartment_5fcbebdc00
-INFO stdout          > SF:$(SOURCE_DIR)/mozilla/js/src/jit-test/tests/coverage/simple.js line 60 > eval
-INFO stdout          > FN:1,top-level
-INFO stdout          > FNDA:1,top-level
-INFO stdout          > FNF:1
-INFO stdout          > FNH:1
-INFO stdout          > BRDA:3,0,0,0
-INFO stdout          > BRDA:3,0,1,-
-INFO stdout          > BRF:2
-INFO stdout          > BRH:1
-INFO stdout          > DA:2,1
-INFO stdout          > DA:3,1
-INFO stdout          > DA:4,0
-INFO stdout          > DA:5,1
-INFO stdout          > LF:4
-INFO stdout          > LH:3
-INFO stdout          > end_of_record
-INFO stdout          > 
-INFO stdout          > In the following source:
-INFO stdout          > //FN:$,top-level //FNDA:1,%
-INFO stdout          > var l = ",".split(','); //DA:$,1
-INFO stdout          > if (l.length == 3)      //DA:$,1 //BRDA:$,0,0,1 //BRDA:$,0,1,-
-INFO stdout          > l.push('');           //DA:$,0
-INFO stdout          > l.pop();                //DA:$,1
-INFO stdout          > //FNF:1
-INFO stdout          > //FNH:1
-INFO stdout          > //LF:4
-INFO stdout          > //LH:3
-INFO stdout          > //BRF:2
-INFO stdout          > //BRH:1
-INFO stdout          > 
-INFO stderr         2> $(SOURCE_DIR)/mozilla/js/src/jit-test/tests/coverage/simple.js:69:7 Error: Assertion failed: got true, expected false
-INFO stderr         2> Stack:
-INFO stderr         2> [email protected]$(SOURCE_DIR)/mozilla/js/src/jit-test/tests/coverage/simple.js:69:7
-INFO stderr         2> @$(SOURCE_DIR)/mozilla/js/src/jit-test/tests/coverage/simple.js:104:1
-Cannot find `BRDA:3,0,0,1` in the following Lcov result:
- TN:Compartment_5fd10bdc00
-SF:$(SOURCE_DIR)/mozilla/js/src/jit-test/tests/coverage/simple.js line 60 > eval
-FN:1,top-level
-FNDA:1,top-level
-FNF:1
-FNH:1
-BRDA:3,0,0,0
-BRDA:3,0,1,-
-BRF:2
-BRH:1
-DA:2,1
-DA:3,1
-DA:4,0
-DA:5,1
-LF:4
-LH:3
-end_of_record
-
-In the following source:
-  //FN:$,top-level //FNDA:1,%
-  var l = ",".split(','); //DA:$,1
-  if (l.length == 3)      //DA:$,1 //BRDA:$,0,0,1 //BRDA:$,0,1,-
-    l.push('');           //DA:$,0
-  l.pop();                //DA:$,1
-  //FNF:1
-  //FNH:1
-  //LF:4
-  //LH:3
-  //BRF:2
-  //BRH:1
-
-$(SOURCE_DIR)/mozilla/js/src/jit-test/tests/coverage/simple.js:69:7 Error: Assertion failed: got true, expected false
-Stack:
-  [email protected]$(SOURCE_DIR)/mozilla/js/src/jit-test/tests/coverage/simple.js:69:7
-  @$(SOURCE_DIR)/mozilla/js/src/jit-test/tests/coverage/simple.js:104:1
-Exit code: 3
-FAIL - coverage/simple.js
-TEST-UNEXPECTED-FAIL | js/src/jit-test/tests/coverage/simple.js | $(SOURCE_DIR)/mozilla/js/src/jit-test/tests/coverage/simple.js:69:7 Error: Assertion failed: got true, expected false (code 3, args "--code-coverage --no-baseline --no-ion")
-INFO exit-status     : 3
-INFO timed-out       : False
-INFO stdout          > Cannot find `BRDA:3,0,0,1` in the following Lcov result:
-INFO stdout          > TN:Compartment_5fd10bdc00
-INFO stdout          > SF:$(SOURCE_DIR)/mozilla/js/src/jit-test/tests/coverage/simple.js line 60 > eval
-INFO stdout          > FN:1,top-level
-INFO stdout          > FNDA:1,top-level
-INFO stdout          > FNF:1
-INFO stdout          > FNH:1
-INFO stdout          > BRDA:3,0,0,0
-INFO stdout          > BRDA:3,0,1,-
-INFO stdout          > BRF:2
-INFO stdout          > BRH:1
-INFO stdout          > DA:2,1
-INFO stdout          > DA:3,1
-INFO stdout          > DA:4,0
-INFO stdout          > DA:5,1
-INFO stdout          > LF:4
-INFO stdout          > LH:3
-INFO stdout          > end_of_record
-INFO stdout          > 
-INFO stdout          > In the following source:
-INFO stdout          > //FN:$,top-level //FNDA:1,%
-INFO stdout          > var l = ",".split(','); //DA:$,1
-INFO stdout          > if (l.length == 3)      //DA:$,1 //BRDA:$,0,0,1 //BRDA:$,0,1,-
-INFO stdout          > l.push('');           //DA:$,0
-INFO stdout          > l.pop();                //DA:$,1
-INFO stdout          > //FNF:1
-INFO stdout          > //FNH:1
-INFO stdout          > //LF:4
-INFO stdout          > //LH:3
-INFO stdout          > //BRF:2
-INFO stdout          > //BRH:1
-INFO stdout          > 
-INFO stderr         2> $(SOURCE_DIR)/mozilla/js/src/jit-test/tests/coverage/simple.js:69:7 Error: Assertion failed: got true, expected false
-INFO stderr         2> Stack:
-INFO stderr         2> [email protected]$(SOURCE_DIR)/mozilla/js/src/jit-test/tests/coverage/simple.js:69:7
-INFO stderr         2> @$(SOURCE_DIR)/mozilla/js/src/jit-test/tests/coverage/simple.js:104:1
-$(SOURCE_DIR)/mozilla/js/src/jit-test/tests/ctypes/conversion-native-function.js:15:14 Error: couldn't find function symbol in library
-Stack:
-  [email protected]$(SOURCE_DIR)/mozilla/js/src/jit-test/tests/ctypes/conversion-native-function.js:15:14
-  @$(SOURCE_DIR)/mozilla/js/src/jit-test/tests/ctypes/conversion-native-function.js:37:3
-Exit code: 3
-FAIL - ctypes/conversion-native-function.js
-TEST-UNEXPECTED-FAIL | js/src/jit-test/tests/ctypes/conversion-native-function.js | $(SOURCE_DIR)/mozilla/js/src/jit-test/tests/ctypes/conversion-native-function.js:15:14 Error: couldn't find function symbol in library (code 3, args "")
-INFO exit-status     : 3
-INFO timed-out       : False
-INFO stderr         2> $(SOURCE_DIR)/mozilla/js/src/jit-test/tests/ctypes/conversion-native-function.js:15:14 Error: couldn't find function symbol in library
-INFO stderr         2> Stack:
-INFO stderr         2> [email protected]$(SOURCE_DIR)/mozilla/js/src/jit-test/tests/ctypes/conversion-native-function.js:15:14
-INFO stderr         2> @$(SOURCE_DIR)/mozilla/js/src/jit-test/tests/ctypes/conversion-native-function.js:37:3
-$(SOURCE_DIR)/mozilla/js/src/jit-test/tests/ctypes/conversion-native-function.js:15:14 Error: couldn't find function symbol in library
-Stack:
-  [email protected]$(SOURCE_DIR)/mozilla/js/src/jit-test/tests/ctypes/conversion-native-function.js:15:14
-  @$(SOURCE_DIR)/mozilla/js/src/jit-test/tests/ctypes/conversion-native-function.js:37:3
-Exit code: 3
-FAIL - ctypes/conversion-native-function.js
-TEST-UNEXPECTED-FAIL | js/src/jit-test/tests/ctypes/conversion-native-function.js | $(SOURCE_DIR)/mozilla/js/src/jit-test/tests/ctypes/conversion-native-function.js:15:14 Error: couldn't find function symbol in library (code 3, args "--ion-eager --ion-offthread-compile=off --non-writable-jitcode --ion-check-range-analysis --ion-extra-checks --no-sse3 --no-threads")
-INFO exit-status     : 3
-INFO timed-out       : False
-INFO stderr         2> $(SOURCE_DIR)/mozilla/js/src/jit-test/tests/ctypes/conversion-native-function.js:15:14 Error: couldn't find function symbol in library
-INFO stderr         2> Stack:
-INFO stderr         2> [email protected]$(SOURCE_DIR)/mozilla/js/src/jit-test/tests/ctypes/conversion-native-function.js:15:14
-INFO stderr         2> @$(SOURCE_DIR)/mozilla/js/src/jit-test/tests/ctypes/conversion-native-function.js:37:3
-$(SOURCE_DIR)/mozilla/js/src/jit-test/tests/ctypes/conversion-native-function.js:15:14 Error: couldn't find function symbol in library
-Stack:
-  [email protected]$(SOURCE_DIR)/mozilla/js/src/jit-test/tests/ctypes/conversion-native-function.js:15:14
-  @$(SOURCE_DIR)/mozilla/js/src/jit-test/tests/ctypes/conversion-native-function.js:37:3
-Exit code: 3
-FAIL - ctypes/conversion-native-function.js
-TEST-UNEXPECTED-FAIL | js/src/jit-test/tests/ctypes/conversion-native-function.js | $(SOURCE_DIR)/mozilla/js/src/jit-test/tests/ctypes/conversion-native-function.js:15:14 Error: couldn't find function symbol in library (code 3, args "--ion-eager --ion-offthread-compile=off")
-INFO exit-status     : 3
-INFO timed-out       : False
-INFO stderr         2> $(SOURCE_DIR)/mozilla/js/src/jit-test/tests/ctypes/conversion-native-function.js:15:14 Error: couldn't find function symbol in library
-INFO stderr         2> Stack:
-INFO stderr         2> [email protected]$(SOURCE_DIR)/mozilla/js/src/jit-test/tests/ctypes/conversion-native-function.js:15:14
-INFO stderr         2> @$(SOURCE_DIR)/mozilla/js/src/jit-test/tests/ctypes/conversion-native-function.js:37:3
-$(SOURCE_DIR)/mozilla/js/src/jit-test/tests/ctypes/conversion-native-function.js:15:14 Error: couldn't find function symbol in library
-Stack:
-  [email protected]$(SOURCE_DIR)/mozilla/js/src/jit-test/tests/ctypes/conversion-native-function.js:15:14
-  @$(SOURCE_DIR)/mozilla/js/src/jit-test/tests/ctypes/conversion-native-function.js:37:3
-Exit code: 3
-FAIL - ctypes/conversion-native-function.js
-TEST-UNEXPECTED-FAIL | js/src/jit-test/tests/ctypes/conversion-native-function.js | $(SOURCE_DIR)/mozilla/js/src/jit-test/tests/ctypes/conversion-native-function.js:15:14 Error: couldn't find function symbol in library (code 3, args "--baseline-eager")
-INFO exit-status     : 3
-INFO timed-out       : False
-INFO stderr         2> $(SOURCE_DIR)/mozilla/js/src/jit-test/tests/ctypes/conversion-native-function.js:15:14 Error: couldn't find function symbol in library
-INFO stderr         2> Stack:
-INFO stderr         2> [email protected]$(SOURCE_DIR)/mozilla/js/src/jit-test/tests/ctypes/conversion-native-function.js:15:14
-INFO stderr         2> @$(SOURCE_DIR)/mozilla/js/src/jit-test/tests/ctypes/conversion-native-function.js:37:3
-$(SOURCE_DIR)/mozilla/js/src/jit-test/tests/ctypes/conversion-native-function.js:15:14 Error: couldn't find function symbol in library
-Stack:
-  [email protected]$(SOURCE_DIR)/mozilla/js/src/jit-test/tests/ctypes/conversion-native-function.js:15:14
-  @$(SOURCE_DIR)/mozilla/js/src/jit-test/tests/ctypes/conversion-native-function.js:37:3
-Exit code: 3
-FAIL - ctypes/conversion-native-function.js
-TEST-UNEXPECTED-FAIL | js/src/jit-test/tests/ctypes/conversion-native-function.js | $(SOURCE_DIR)/mozilla/js/src/jit-test/tests/ctypes/conversion-native-function.js:15:14 Error: couldn't find function symbol in library (code 3, args "--baseline-eager --no-fpu")
-INFO exit-status     : 3
-INFO timed-out       : False
-INFO stderr         2> $(SOURCE_DIR)/mozilla/js/src/jit-test/tests/ctypes/conversion-native-function.js:15:14 Error: couldn't find function symbol in library
-INFO stderr         2> Stack:
-INFO stderr         2> [email protected]$(SOURCE_DIR)/mozilla/js/src/jit-test/tests/ctypes/conversion-native-function.js:15:14
-INFO stderr         2> @$(SOURCE_DIR)/mozilla/js/src/jit-test/tests/ctypes/conversion-native-function.js:37:3
-$(SOURCE_DIR)/mozilla/js/src/jit-test/tests/ctypes/conversion-native-function.js:15:14 Error: couldn't find function symbol in library
-Stack:
-  [email protected]$(SOURCE_DIR)/mozilla/js/src/jit-test/tests/ctypes/conversion-native-function.js:15:14
-  @$(SOURCE_DIR)/mozilla/js/src/jit-test/tests/ctypes/conversion-native-function.js:37:3
-Exit code: 3
-FAIL - ctypes/conversion-native-function.js
-TEST-UNEXPECTED-FAIL | js/src/jit-test/tests/ctypes/conversion-native-function.js | $(SOURCE_DIR)/mozilla/js/src/jit-test/tests/ctypes/conversion-native-function.js:15:14 Error: couldn't find function symbol in library (code 3, args "--no-baseline --no-ion")
-INFO exit-status     : 3
-INFO timed-out       : False
-INFO stderr         2> $(SOURCE_DIR)/mozilla/js/src/jit-test/tests/ctypes/conversion-native-function.js:15:14 Error: couldn't find function symbol in library
-INFO stderr         2> Stack:
-INFO stderr         2> [email protected]$(SOURCE_DIR)/mozilla/js/src/jit-test/tests/ctypes/conversion-native-function.js:15:14
-INFO stderr         2> @$(SOURCE_DIR)/mozilla/js/src/jit-test/tests/ctypes/conversion-native-function.js:37:3
-$(SOURCE_DIR)/mozilla/js/src/jit-test/tests/debug/Debugger-allowUnobservedAsmJS-02.js:21:1 Error: Assertion failed: got false, expected true
-Stack:
-  @$(SOURCE_DIR)/mozilla/js/src/jit-test/tests/debug/Debugger-allowUnobservedAsmJS-02.js:21:1
-Exit code: 3
-FAIL - debug/Debugger-allowUnobservedAsmJS-02.js
-TEST-UNEXPECTED-FAIL | js/src/jit-test/tests/debug/Debugger-allowUnobservedAsmJS-02.js | $(SOURCE_DIR)/mozilla/js/src/jit-test/tests/debug/Debugger-allowUnobservedAsmJS-02.js:21:1 Error: Assertion failed: got false, expected true (code 3, args "")
-INFO exit-status     : 3
-INFO timed-out       : False
-INFO stderr         2> $(SOURCE_DIR)/mozilla/js/src/jit-test/tests/debug/Debugger-allowUnobservedAsmJS-02.js:21:1 Error: Assertion failed: got false, expected true
-INFO stderr         2> Stack:
-INFO stderr         2> @$(SOURCE_DIR)/mozilla/js/src/jit-test/tests/debug/Debugger-allowUnobservedAsmJS-02.js:21:1
-$(SOURCE_DIR)/mozilla/js/src/jit-test/tests/debug/Debugger-allowUnobservedAsmJS-02.js:21:1 Error: Assertion failed: got false, expected true
-Stack:
-  @$(SOURCE_DIR)/mozilla/js/src/jit-test/tests/debug/Debugger-allowUnobservedAsmJS-02.js:21:1
-Exit code: 3
-FAIL - debug/Debugger-allowUnobservedAsmJS-02.js
-TEST-UNEXPECTED-FAIL | js/src/jit-test/tests/debug/Debugger-allowUnobservedAsmJS-02.js | $(SOURCE_DIR)/mozilla/js/src/jit-test/tests/debug/Debugger-allowUnobservedAsmJS-02.js:21:1 Error: Assertion failed: got false, expected true (code 3, args "--ion-eager --ion-offthread-compile=off")
-INFO exit-status     : 3
-INFO timed-out       : False
-INFO stderr         2> $(SOURCE_DIR)/mozilla/js/src/jit-test/tests/debug/Debugger-allowUnobservedAsmJS-02.js:21:1 Error: Assertion failed: got false, expected true
-INFO stderr         2> Stack:
-INFO stderr         2> @$(SOURCE_DIR)/mozilla/js/src/jit-test/tests/debug/Debugger-allowUnobservedAsmJS-02.js:21:1
-$(SOURCE_DIR)/mozilla/js/src/jit-test/tests/debug/Debugger-allowUnobservedAsmJS-02.js:21:1 Error: Assertion failed: got false, expected true
-Stack:
-  @$(SOURCE_DIR)/mozilla/js/src/jit-test/tests/debug/Debugger-allowUnobservedAsmJS-02.js:21:1
-Exit code: 3
-FAIL - debug/Debugger-allowUnobservedAsmJS-02.js
-TEST-UNEXPECTED-FAIL | js/src/jit-test/tests/debug/Debugger-allowUnobservedAsmJS-02.js | $(SOURCE_DIR)/mozilla/js/src/jit-test/tests/debug/Debugger-allowUnobservedAsmJS-02.js:21:1 Error: Assertion failed: got false, expected true (code 3, args "--baseline-eager")
-INFO exit-status     : 3
-INFO timed-out       : False
-INFO stderr         2> $(SOURCE_DIR)/mozilla/js/src/jit-test/tests/debug/Debugger-allowUnobservedAsmJS-02.js:21:1 Error: Assertion failed: got false, expected true
-INFO stderr         2> Stack:
-INFO stderr         2> @$(SOURCE_DIR)/mozilla/js/src/jit-test/tests/debug/Debugger-allowUnobservedAsmJS-02.js:21:1
-$(SOURCE_DIR)/mozilla/js/src/jit-test/tests/debug/Debugger-allowUnobservedAsmJS-02.js:21:1 Error: Assertion failed: got false, expected true
-Stack:
-  @$(SOURCE_DIR)/mozilla/js/src/jit-test/tests/debug/Debugger-allowUnobservedAsmJS-02.js:21:1
-Exit code: 3
-FAIL - debug/Debugger-allowUnobservedAsmJS-02.js
-TEST-UNEXPECTED-FAIL | js/src/jit-test/tests/debug/Debugger-allowUnobservedAsmJS-02.js | $(SOURCE_DIR)/mozilla/js/src/jit-test/tests/debug/Debugger-allowUnobservedAsmJS-02.js:21:1 Error: Assertion failed: got false, expected true (code 3, args "--baseline-eager --no-fpu")
-INFO exit-status     : 3
-INFO timed-out       : False
-INFO stderr         2> $(SOURCE_DIR)/mozilla/js/src/jit-test/tests/debug/Debugger-allowUnobservedAsmJS-02.js:21:1 Error: Assertion failed: got false, expected true
-INFO stderr         2> Stack:
-INFO stderr         2> @$(SOURCE_DIR)/mozilla/js/src/jit-test/tests/debug/Debugger-allowUnobservedAsmJS-02.js:21:1
-$(SOURCE_DIR)/mozilla/js/src/jit-test/tests/debug/Debugger-allowUnobservedAsmJS-02.js:21:1 Error: Assertion failed: got false, expected true
-Stack:
-  @$(SOURCE_DIR)/mozilla/js/src/jit-test/tests/debug/Debugger-allowUnobservedAsmJS-02.js:21:1
-Exit code: 3
-FAIL - debug/Debugger-allowUnobservedAsmJS-02.js
-TEST-UNEXPECTED-FAIL | js/src/jit-test/tests/debug/Debugger-allowUnobservedAsmJS-02.js | $(SOURCE_DIR)/mozilla/js/src/jit-test/tests/debug/Debugger-allowUnobservedAsmJS-02.js:21:1 Error: Assertion failed: got false, expected true (code 3, args "--no-baseline --no-ion")
-INFO exit-status     : 3
-INFO timed-out       : False
-INFO stderr         2> $(SOURCE_DIR)/mozilla/js/src/jit-test/tests/debug/Debugger-allowUnobservedAsmJS-02.js:21:1 Error: Assertion failed: got false, expected true
-INFO stderr         2> Stack:
-INFO stderr         2> @$(SOURCE_DIR)/mozilla/js/src/jit-test/tests/debug/Debugger-allowUnobservedAsmJS-02.js:21:1
-$(SOURCE_DIR)/mozilla/js/src/jit-test/tests/ion/bug909997.js:31:5 Error: Assertion failed: got 0, expected 1
-Stack:
-  @$(SOURCE_DIR)/mozilla/js/src/jit-test/tests/ion/bug909997.js:31:5
-Exit code: 3
-FAIL - ion/bug909997.js
-TEST-UNEXPECTED-FAIL | js/src/jit-test/tests/ion/bug909997.js | $(SOURCE_DIR)/mozilla/js/src/jit-test/tests/ion/bug909997.js:31:5 Error: Assertion failed: got 0, expected 1 (code 3, args "")
-INFO exit-status     : 3
-INFO timed-out       : False
-INFO stderr         2> $(SOURCE_DIR)/mozilla/js/src/jit-test/tests/ion/bug909997.js:31:5 Error: Assertion failed: got 0, expected 1
-INFO stderr         2> Stack:
-INFO stderr         2> @$(SOURCE_DIR)/mozilla/js/src/jit-test/tests/ion/bug909997.js:31:5
-$(SOURCE_DIR)/mozilla/js/src/jit-test/tests/ion/bug909997.js:31:5 Error: Assertion failed: got 0, expected 1
-Stack:
-  @$(SOURCE_DIR)/mozilla/js/src/jit-test/tests/ion/bug909997.js:31:5
-Exit code: 3
-FAIL - ion/bug909997.js
-TEST-UNEXPECTED-FAIL | js/src/jit-test/tests/ion/bug909997.js | $(SOURCE_DIR)/mozilla/js/src/jit-test/tests/ion/bug909997.js:31:5 Error: Assertion failed: got 0, expected 1 (code 3, args "--ion-eager --ion-offthread-compile=off --non-writable-jitcode --ion-check-range-analysis --ion-extra-checks --no-sse3 --no-threads")
-INFO exit-status     : 3
-INFO timed-out       : False
-INFO stderr         2> $(SOURCE_DIR)/mozilla/js/src/jit-test/tests/ion/bug909997.js:31:5 Error: Assertion failed: got 0, expected 1
-INFO stderr         2> Stack:
-INFO stderr         2> @$(SOURCE_DIR)/mozilla/js/src/jit-test/tests/ion/bug909997.js:31:5
-$(SOURCE_DIR)/mozilla/js/src/jit-test/tests/ion/bug909997.js:31:5 Error: Assertion failed: got 0, expected 1
-Stack:
-  @$(SOURCE_DIR)/mozilla/js/src/jit-test/tests/ion/bug909997.js:31:5
-Exit code: 3
-FAIL - ion/bug909997.js
-TEST-UNEXPECTED-FAIL | js/src/jit-test/tests/ion/bug909997.js | $(SOURCE_DIR)/mozilla/js/src/jit-test/tests/ion/bug909997.js:31:5 Error: Assertion failed: got 0, expected 1 (code 3, args "--ion-eager --ion-offthread-compile=off")
-INFO exit-status     : 3
-INFO timed-out       : False
-INFO stderr         2> $(SOURCE_DIR)/mozilla/js/src/jit-test/tests/ion/bug909997.js:31:5 Error: Assertion failed: got 0, expected 1
-INFO stderr         2> Stack:
-INFO stderr         2> @$(SOURCE_DIR)/mozilla/js/src/jit-test/tests/ion/bug909997.js:31:5
-$(SOURCE_DIR)/mozilla/js/src/jit-test/tests/ion/bug909997.js:31:5 Error: Assertion failed: got 0, expected 1
-Stack:
-  @$(SOURCE_DIR)/mozilla/js/src/jit-test/tests/ion/bug909997.js:31:5
-Exit code: 3
-FAIL - ion/bug909997.js
-TEST-UNEXPECTED-FAIL | js/src/jit-test/tests/ion/bug909997.js | $(SOURCE_DIR)/mozilla/js/src/jit-test/tests/ion/bug909997.js:31:5 Error: Assertion failed: got 0, expected 1 (code 3, args "--baseline-eager")
-INFO exit-status     : 3
-INFO timed-out       : False
-INFO stderr         2> $(SOURCE_DIR)/mozilla/js/src/jit-test/tests/ion/bug909997.js:31:5 Error: Assertion failed: got 0, expected 1
-INFO stderr         2> Stack:
-INFO stderr         2> @$(SOURCE_DIR)/mozilla/js/src/jit-test/tests/ion/bug909997.js:31:5
-$(SOURCE_DIR)/mozilla/js/src/jit-test/tests/ion/bug909997.js:31:5 Error: Assertion failed: got 0, expected 1
-Stack:
-  @$(SOURCE_DIR)/mozilla/js/src/jit-test/tests/ion/bug909997.js:31:5
-Exit code: 3
-FAIL - ion/bug909997.js
-TEST-UNEXPECTED-FAIL | js/src/jit-test/tests/ion/bug909997.js | $(SOURCE_DIR)/mozilla/js/src/jit-test/tests/ion/bug909997.js:31:5 Error: Assertion failed: got 0, expected 1 (code 3, args "--baseline-eager --no-fpu")
-INFO exit-status     : 3
-INFO timed-out       : False
-INFO stderr         2> $(SOURCE_DIR)/mozilla/js/src/jit-test/tests/ion/bug909997.js:31:5 Error: Assertion failed: got 0, expected 1
-INFO stderr         2> Stack:
-INFO stderr         2> @$(SOURCE_DIR)/mozilla/js/src/jit-test/tests/ion/bug909997.js:31:5
-$(SOURCE_DIR)/mozilla/js/src/jit-test/tests/ion/bug909997.js:31:5 Error: Assertion failed: got 0, expected 1
-Stack:
-  @$(SOURCE_DIR)/mozilla/js/src/jit-test/tests/ion/bug909997.js:31:5
-Exit code: 3
-FAIL - ion/bug909997.js
-TEST-UNEXPECTED-FAIL | js/src/jit-test/tests/ion/bug909997.js | $(SOURCE_DIR)/mozilla/js/src/jit-test/tests/ion/bug909997.js:31:5 Error: Assertion failed: got 0, expected 1 (code 3, args "--no-baseline --no-ion")
-INFO exit-status     : 3
-INFO timed-out       : False
-INFO stderr         2> $(SOURCE_DIR)/mozilla/js/src/jit-test/tests/ion/bug909997.js:31:5 Error: Assertion failed: got 0, expected 1
-INFO stderr         2> Stack:
-INFO stderr         2> @$(SOURCE_DIR)/mozilla/js/src/jit-test/tests/ion/bug909997.js:31:5
-FAILURES:
-    $(@D)/dist/bin/js -f $(SOURCE_DIR)/mozilla/js/src/jit-test/lib/prologue.js --js-cache $(SOURCE_DIR)/mozilla/js/src/jit-test/.js-cache -e "const platform='sunos5'; const libdir='$(SOURCE_DIR)/mozilla/js/src/jit-test/lib/'; const scriptdir='$(SOURCE_DIR)/mozilla/js/src/jit-test/tests/asm.js/'" -f $(SOURCE_DIR)/mozilla/js/src/jit-test/tests/asm.js/testHeapAccess.js
-    $(@D)/dist/bin/js -f $(SOURCE_DIR)/mozilla/js/src/jit-test/lib/prologue.js --js-cache $(SOURCE_DIR)/mozilla/js/src/jit-test/.js-cache --ion-extra-checks --non-writable-jitcode --ion-check-range-analysis --ion-offthread-compile=off --no-threads --ion-eager --no-sse3 -e "const platform='sunos5'; const libdir='$(SOURCE_DIR)/mozilla/js/src/jit-test/lib/'; const scriptdir='$(SOURCE_DIR)/mozilla/js/src/jit-test/tests/asm.js/'" -f $(SOURCE_DIR)/mozilla/js/src/jit-test/tests/asm.js/testHeapAccess.js
-    $(@D)/dist/bin/js -f $(SOURCE_DIR)/mozilla/js/src/jit-test/lib/prologue.js --js-cache $(SOURCE_DIR)/mozilla/js/src/jit-test/.js-cache --ion-eager --ion-offthread-compile=off -e "const platform='sunos5'; const libdir='$(SOURCE_DIR)/mozilla/js/src/jit-test/lib/'; const scriptdir='$(SOURCE_DIR)/mozilla/js/src/jit-test/tests/asm.js/'" -f $(SOURCE_DIR)/mozilla/js/src/jit-test/tests/asm.js/testHeapAccess.js
-    $(@D)/dist/bin/js -f $(SOURCE_DIR)/mozilla/js/src/jit-test/lib/prologue.js --js-cache $(SOURCE_DIR)/mozilla/js/src/jit-test/.js-cache --baseline-eager -e "const platform='sunos5'; const libdir='$(SOURCE_DIR)/mozilla/js/src/jit-test/lib/'; const scriptdir='$(SOURCE_DIR)/mozilla/js/src/jit-test/tests/asm.js/'" -f $(SOURCE_DIR)/mozilla/js/src/jit-test/tests/asm.js/testHeapAccess.js
-    $(@D)/dist/bin/js -f $(SOURCE_DIR)/mozilla/js/src/jit-test/lib/prologue.js --js-cache $(SOURCE_DIR)/mozilla/js/src/jit-test/.js-cache --baseline-eager --no-fpu -e "const platform='sunos5'; const libdir='$(SOURCE_DIR)/mozilla/js/src/jit-test/lib/'; const scriptdir='$(SOURCE_DIR)/mozilla/js/src/jit-test/tests/asm.js/'" -f $(SOURCE_DIR)/mozilla/js/src/jit-test/tests/asm.js/testHeapAccess.js
-    $(@D)/dist/bin/js -f $(SOURCE_DIR)/mozilla/js/src/jit-test/lib/prologue.js --js-cache $(SOURCE_DIR)/mozilla/js/src/jit-test/.js-cache --no-baseline --no-ion -e "const platform='sunos5'; const libdir='$(SOURCE_DIR)/mozilla/js/src/jit-test/lib/'; const scriptdir='$(SOURCE_DIR)/mozilla/js/src/jit-test/tests/asm.js/'" -f $(SOURCE_DIR)/mozilla/js/src/jit-test/tests/asm.js/testHeapAccess.js
-    $(@D)/dist/bin/js -f $(SOURCE_DIR)/mozilla/js/src/jit-test/lib/prologue.js --js-cache $(SOURCE_DIR)/mozilla/js/src/jit-test/.js-cache --no-asmjs -e "const platform='sunos5'; const libdir='$(SOURCE_DIR)/mozilla/js/src/jit-test/lib/'; const scriptdir='$(SOURCE_DIR)/mozilla/js/src/jit-test/tests/asm.js/'" -f $(SOURCE_DIR)/mozilla/js/src/jit-test/tests/asm.js/testHeapAccess.js
-    $(@D)/dist/bin/js -f $(SOURCE_DIR)/mozilla/js/src/jit-test/lib/prologue.js --js-cache $(SOURCE_DIR)/mozilla/js/src/jit-test/.js-cache --code-coverage -e "const platform='sunos5'; const libdir='$(SOURCE_DIR)/mozilla/js/src/jit-test/lib/'; const scriptdir='$(SOURCE_DIR)/mozilla/js/src/jit-test/tests/coverage/'" -f $(SOURCE_DIR)/mozilla/js/src/jit-test/tests/coverage/simple.js
-    $(@D)/dist/bin/js -f $(SOURCE_DIR)/mozilla/js/src/jit-test/lib/prologue.js --js-cache $(SOURCE_DIR)/mozilla/js/src/jit-test/.js-cache --ion-eager --ion-offthread-compile=off --code-coverage -e "const platform='sunos5'; const libdir='$(SOURCE_DIR)/mozilla/js/src/jit-test/lib/'; const scriptdir='$(SOURCE_DIR)/mozilla/js/src/jit-test/tests/coverage/'" -f $(SOURCE_DIR)/mozilla/js/src/jit-test/tests/coverage/simple.js
-    $(@D)/dist/bin/js -f $(SOURCE_DIR)/mozilla/js/src/jit-test/lib/prologue.js --js-cache $(SOURCE_DIR)/mozilla/js/src/jit-test/.js-cache --ion-extra-checks --non-writable-jitcode --ion-check-range-analysis --ion-offthread-compile=off --no-threads --ion-eager --code-coverage --no-sse3 -e "const platform='sunos5'; const libdir='$(SOURCE_DIR)/mozilla/js/src/jit-test/lib/'; const scriptdir='$(SOURCE_DIR)/mozilla/js/src/jit-test/tests/coverage/'" -f $(SOURCE_DIR)/mozilla/js/src/jit-test/tests/coverage/simple.js
-    $(@D)/dist/bin/js -f $(SOURCE_DIR)/mozilla/js/src/jit-test/lib/prologue.js --js-cache $(SOURCE_DIR)/mozilla/js/src/jit-test/.js-cache --baseline-eager --code-coverage -e "const platform='sunos5'; const libdir='$(SOURCE_DIR)/mozilla/js/src/jit-test/lib/'; const scriptdir='$(SOURCE_DIR)/mozilla/js/src/jit-test/tests/coverage/'" -f $(SOURCE_DIR)/mozilla/js/src/jit-test/tests/coverage/simple.js
-    $(@D)/dist/bin/js -f $(SOURCE_DIR)/mozilla/js/src/jit-test/lib/prologue.js --js-cache $(SOURCE_DIR)/mozilla/js/src/jit-test/.js-cache --baseline-eager --no-fpu --code-coverage -e "const platform='sunos5'; const libdir='$(SOURCE_DIR)/mozilla/js/src/jit-test/lib/'; const scriptdir='$(SOURCE_DIR)/mozilla/js/src/jit-test/tests/coverage/'" -f $(SOURCE_DIR)/mozilla/js/src/jit-test/tests/coverage/simple.js
-    $(@D)/dist/bin/js -f $(SOURCE_DIR)/mozilla/js/src/jit-test/lib/prologue.js --js-cache $(SOURCE_DIR)/mozilla/js/src/jit-test/.js-cache --no-baseline --no-ion --code-coverage -e "const platform='sunos5'; const libdir='$(SOURCE_DIR)/mozilla/js/src/jit-test/lib/'; const scriptdir='$(SOURCE_DIR)/mozilla/js/src/jit-test/tests/coverage/'" -f $(SOURCE_DIR)/mozilla/js/src/jit-test/tests/coverage/simple.js
-    $(@D)/dist/bin/js -f $(SOURCE_DIR)/mozilla/js/src/jit-test/lib/prologue.js --js-cache $(SOURCE_DIR)/mozilla/js/src/jit-test/.js-cache -e "const platform='sunos5'; const libdir='$(SOURCE_DIR)/mozilla/js/src/jit-test/lib/'; const scriptdir='$(SOURCE_DIR)/mozilla/js/src/jit-test/tests/ctypes/'" -f $(SOURCE_DIR)/mozilla/js/src/jit-test/tests/ctypes/conversion-native-function.js
-    $(@D)/dist/bin/js -f $(SOURCE_DIR)/mozilla/js/src/jit-test/lib/prologue.js --js-cache $(SOURCE_DIR)/mozilla/js/src/jit-test/.js-cache --ion-extra-checks --non-writable-jitcode --ion-check-range-analysis --ion-offthread-compile=off --no-threads --ion-eager --no-sse3 -e "const platform='sunos5'; const libdir='$(SOURCE_DIR)/mozilla/js/src/jit-test/lib/'; const scriptdir='$(SOURCE_DIR)/mozilla/js/src/jit-test/tests/ctypes/'" -f $(SOURCE_DIR)/mozilla/js/src/jit-test/tests/ctypes/conversion-native-function.js
-    $(@D)/dist/bin/js -f $(SOURCE_DIR)/mozilla/js/src/jit-test/lib/prologue.js --js-cache $(SOURCE_DIR)/mozilla/js/src/jit-test/.js-cache --ion-eager --ion-offthread-compile=off -e "const platform='sunos5'; const libdir='$(SOURCE_DIR)/mozilla/js/src/jit-test/lib/'; const scriptdir='$(SOURCE_DIR)/mozilla/js/src/jit-test/tests/ctypes/'" -f $(SOURCE_DIR)/mozilla/js/src/jit-test/tests/ctypes/conversion-native-function.js
-    $(@D)/dist/bin/js -f $(SOURCE_DIR)/mozilla/js/src/jit-test/lib/prologue.js --js-cache $(SOURCE_DIR)/mozilla/js/src/jit-test/.js-cache --baseline-eager -e "const platform='sunos5'; const libdir='$(SOURCE_DIR)/mozilla/js/src/jit-test/lib/'; const scriptdir='$(SOURCE_DIR)/mozilla/js/src/jit-test/tests/ctypes/'" -f $(SOURCE_DIR)/mozilla/js/src/jit-test/tests/ctypes/conversion-native-function.js
-    $(@D)/dist/bin/js -f $(SOURCE_DIR)/mozilla/js/src/jit-test/lib/prologue.js --js-cache $(SOURCE_DIR)/mozilla/js/src/jit-test/.js-cache --baseline-eager --no-fpu -e "const platform='sunos5'; const libdir='$(SOURCE_DIR)/mozilla/js/src/jit-test/lib/'; const scriptdir='$(SOURCE_DIR)/mozilla/js/src/jit-test/tests/ctypes/'" -f $(SOURCE_DIR)/mozilla/js/src/jit-test/tests/ctypes/conversion-native-function.js
-    $(@D)/dist/bin/js -f $(SOURCE_DIR)/mozilla/js/src/jit-test/lib/prologue.js --js-cache $(SOURCE_DIR)/mozilla/js/src/jit-test/.js-cache --no-baseline --no-ion -e "const platform='sunos5'; const libdir='$(SOURCE_DIR)/mozilla/js/src/jit-test/lib/'; const scriptdir='$(SOURCE_DIR)/mozilla/js/src/jit-test/tests/ctypes/'" -f $(SOURCE_DIR)/mozilla/js/src/jit-test/tests/ctypes/conversion-native-function.js
-    $(@D)/dist/bin/js -f $(SOURCE_DIR)/mozilla/js/src/jit-test/lib/prologue.js --js-cache $(SOURCE_DIR)/mozilla/js/src/jit-test/.js-cache -e "const platform='sunos5'; const libdir='$(SOURCE_DIR)/mozilla/js/src/jit-test/lib/'; const scriptdir='$(SOURCE_DIR)/mozilla/js/src/jit-test/tests/debug/'" -f $(SOURCE_DIR)/mozilla/js/src/jit-test/tests/debug/Debugger-allowUnobservedAsmJS-02.js
-    $(@D)/dist/bin/js -f $(SOURCE_DIR)/mozilla/js/src/jit-test/lib/prologue.js --js-cache $(SOURCE_DIR)/mozilla/js/src/jit-test/.js-cache --ion-eager --ion-offthread-compile=off -e "const platform='sunos5'; const libdir='$(SOURCE_DIR)/mozilla/js/src/jit-test/lib/'; const scriptdir='$(SOURCE_DIR)/mozilla/js/src/jit-test/tests/debug/'" -f $(SOURCE_DIR)/mozilla/js/src/jit-test/tests/debug/Debugger-allowUnobservedAsmJS-02.js
-    $(@D)/dist/bin/js -f $(SOURCE_DIR)/mozilla/js/src/jit-test/lib/prologue.js --js-cache $(SOURCE_DIR)/mozilla/js/src/jit-test/.js-cache --baseline-eager -e "const platform='sunos5'; const libdir='$(SOURCE_DIR)/mozilla/js/src/jit-test/lib/'; const scriptdir='$(SOURCE_DIR)/mozilla/js/src/jit-test/tests/debug/'" -f $(SOURCE_DIR)/mozilla/js/src/jit-test/tests/debug/Debugger-allowUnobservedAsmJS-02.js
-    $(@D)/dist/bin/js -f $(SOURCE_DIR)/mozilla/js/src/jit-test/lib/prologue.js --js-cache $(SOURCE_DIR)/mozilla/js/src/jit-test/.js-cache --baseline-eager --no-fpu -e "const platform='sunos5'; const libdir='$(SOURCE_DIR)/mozilla/js/src/jit-test/lib/'; const scriptdir='$(SOURCE_DIR)/mozilla/js/src/jit-test/tests/debug/'" -f $(SOURCE_DIR)/mozilla/js/src/jit-test/tests/debug/Debugger-allowUnobservedAsmJS-02.js
-    $(@D)/dist/bin/js -f $(SOURCE_DIR)/mozilla/js/src/jit-test/lib/prologue.js --js-cache $(SOURCE_DIR)/mozilla/js/src/jit-test/.js-cache --no-baseline --no-ion -e "const platform='sunos5'; const libdir='$(SOURCE_DIR)/mozilla/js/src/jit-test/lib/'; const scriptdir='$(SOURCE_DIR)/mozilla/js/src/jit-test/tests/debug/'" -f $(SOURCE_DIR)/mozilla/js/src/jit-test/tests/debug/Debugger-allowUnobservedAsmJS-02.js
-    $(@D)/dist/bin/js -f $(SOURCE_DIR)/mozilla/js/src/jit-test/lib/prologue.js --js-cache $(SOURCE_DIR)/mozilla/js/src/jit-test/.js-cache -e "const platform='sunos5'; const libdir='$(SOURCE_DIR)/mozilla/js/src/jit-test/lib/'; const scriptdir='$(SOURCE_DIR)/mozilla/js/src/jit-test/tests/ion/'" -f $(SOURCE_DIR)/mozilla/js/src/jit-test/tests/ion/bug909997.js
-    $(@D)/dist/bin/js -f $(SOURCE_DIR)/mozilla/js/src/jit-test/lib/prologue.js --js-cache $(SOURCE_DIR)/mozilla/js/src/jit-test/.js-cache --ion-extra-checks --non-writable-jitcode --ion-check-range-analysis --ion-offthread-compile=off --no-threads --ion-eager --no-sse3 -e "const platform='sunos5'; const libdir='$(SOURCE_DIR)/mozilla/js/src/jit-test/lib/'; const scriptdir='$(SOURCE_DIR)/mozilla/js/src/jit-test/tests/ion/'" -f $(SOURCE_DIR)/mozilla/js/src/jit-test/tests/ion/bug909997.js
-    $(@D)/dist/bin/js -f $(SOURCE_DIR)/mozilla/js/src/jit-test/lib/prologue.js --js-cache $(SOURCE_DIR)/mozilla/js/src/jit-test/.js-cache --ion-eager --ion-offthread-compile=off -e "const platform='sunos5'; const libdir='$(SOURCE_DIR)/mozilla/js/src/jit-test/lib/'; const scriptdir='$(SOURCE_DIR)/mozilla/js/src/jit-test/tests/ion/'" -f $(SOURCE_DIR)/mozilla/js/src/jit-test/tests/ion/bug909997.js
-    $(@D)/dist/bin/js -f $(SOURCE_DIR)/mozilla/js/src/jit-test/lib/prologue.js --js-cache $(SOURCE_DIR)/mozilla/js/src/jit-test/.js-cache --baseline-eager -e "const platform='sunos5'; const libdir='$(SOURCE_DIR)/mozilla/js/src/jit-test/lib/'; const scriptdir='$(SOURCE_DIR)/mozilla/js/src/jit-test/tests/ion/'" -f $(SOURCE_DIR)/mozilla/js/src/jit-test/tests/ion/bug909997.js
-    $(@D)/dist/bin/js -f $(SOURCE_DIR)/mozilla/js/src/jit-test/lib/prologue.js --js-cache $(SOURCE_DIR)/mozilla/js/src/jit-test/.js-cache --baseline-eager --no-fpu -e "const platform='sunos5'; const libdir='$(SOURCE_DIR)/mozilla/js/src/jit-test/lib/'; const scriptdir='$(SOURCE_DIR)/mozilla/js/src/jit-test/tests/ion/'" -f $(SOURCE_DIR)/mozilla/js/src/jit-test/tests/ion/bug909997.js
-    $(@D)/dist/bin/js -f $(SOURCE_DIR)/mozilla/js/src/jit-test/lib/prologue.js --js-cache $(SOURCE_DIR)/mozilla/js/src/jit-test/.js-cache --no-baseline --no-ion -e "const platform='sunos5'; const libdir='$(SOURCE_DIR)/mozilla/js/src/jit-test/lib/'; const scriptdir='$(SOURCE_DIR)/mozilla/js/src/jit-test/tests/ion/'" -f $(SOURCE_DIR)/mozilla/js/src/jit-test/tests/ion/bug909997.js
-TIMEOUTS:
-Result summary:
-Passed: 29657
-Failed: 30
-make[1]: *** [Makefile:110: check-jit-test] Error 2
-make[1]: Leaving directory '$(@D)/js/src'