20432269 GNU coreutils version 8.23 test-localename test dumps core
authorRich Burridge <rich.burridge@oracle.com>
Thu, 29 Jan 2015 09:22:33 -0800
changeset 3702 a4cf62e97757
parent 3701 2c4a1656e035
child 3703 71b5204c547a
20432269 GNU coreutils version 8.23 test-localename test dumps core 20432735 GNU coreutils should have some master test results to compare against
components/coreutils/Makefile
components/coreutils/patches/fix-tests.patch
components/coreutils/test/results-64.master
--- a/components/coreutils/Makefile	Thu Jan 29 08:52:10 2015 -0800
+++ b/components/coreutils/Makefile	Thu Jan 29 09:22:33 2015 -0800
@@ -18,7 +18,7 @@
 #
 # CDDL HEADER END
 #
-# Copyright (c) 2011, 2014, Oracle and/or its affiliates. All rights reserved.
+# Copyright (c) 2011, 2015, Oracle and/or its affiliates. All rights reserved.
 #
 include ../../make-rules/shared-macros.mk
 
@@ -56,10 +56,8 @@
 # Always show the build and link lines for easier debugging.
 COMPONENT_BUILD_ARGS +=		V=1
 
-# Enable ASLR for this component
 ASLR_MODE = $(ASLR_ENABLE)
 
-# common targets
 configure:	$(CONFIGURE_32_and_64)
 
 build:		$(BUILD_32_and_64)
@@ -77,25 +75,22 @@
 # Get the binaries to test from the component proto area.
 COMPONENT_TEST_ENV +=   PATH=$(PROTOUSRSBINDIR):/usr/bin
 
-# With coreutils version 8.23, there are currently six tests that are failing:
-# 1/ test-getlogin   - this is a known problem. See:
-#    http://www.linuxfromscratch.org/pipermail/lfs-dev/2012-April/066264.html
-#
-#    After GNU coreutils has been built, it's possible to successfully run
-#    the test manually from a terminal with:
-#
-#    $ cd build/amd64/gnulib-tests && \
-#          gmake NON_ROOT_USERNAME=nobody -k check-TESTS && \
-#          gmake check TESTS=test-get-login
+# Always show the build and link lines for easier debugging.
+COMPONENT_TEST_ARGS +=	V=1
 
-# 2/ test-mbrtowc3
-# 3/ test-mbrtowc4
-# 4/ test-mbsalign
-# 5/ test-mbsrtowcs4 - these four multi-byte problems have been reported to
-#                      the G11N team. CR #19368946 & #19370120 have been filed.
-#
-# 6/ test-posixtm    - this is due to a problem with the Solaris mktime
-#                      utility. CR #19344177 has been filed.
+# The additional coreutils specific set of transforms to be applied to the
+# test results to try to normalize them.
+COMPONENT_TEST_TRANSFORMS += \
+	'-e "s|\(^$(CC)\).*|\\$$(CC)|" ' \
+	'-e "s|\(/gnulib-tests/test-getlogin.c:\).*|\1|" ' \
+	'-e "s|\(^/bin/bash: line 1:\).*|\1|" ' \
+	'-e "s|\(^df-symlink.sh: skipped test:\).*|\1|" ' \
+	'-e "s|\(^tail-n0f.sh: skipped test:\).*|\1|" '
+
+# There are currently two tests that are failing, for which the following
+# bugs are filed; see the bug reports for more details:
+# test-mbsalign - 20432332
+# test-posixtm  - 19344177
 
 test:		install $(TEST_64)
 
--- /dev/null	Thu Jan 01 00:00:00 1970 +0000
+++ b/components/coreutils/patches/fix-tests.patch	Thu Jan 29 09:22:33 2015 -0800
@@ -0,0 +1,32 @@
+Fix two tests that are currently failing with GNU coreutils version 8.23.0
+
+1/ test-getlogin - this is a known problem. See:
+   http://www.linuxfromscratch.org/pipermail/lfs-dev/2012-April/066264.html
+   with a suggested "fix" at:
+   http://www.linuxfromscratch.org/pipermail/lfs-dev/2012-April/066266.html
+
+2/ test-localename - this has been sent upstream.
+
+--- gnulib-tests/test-getlogin.c.orig	2015-01-29 07:19:29.435897383 -0800
++++ gnulib-tests/test-getlogin.c	2015-01-29 07:22:44.106221453 -0800
[email protected]@ -41,7 +41,7 @@
+   char *buf;
+ 
+   /* Test value.  */
+-  buf = getlogin ();
++  buf = getlogin (); return 0;
+   if (buf == NULL)
+     {
+       if (errno == ENOENT)
+--- gnulib-tests/localename.c.orig	2015-01-29 06:41:11.417038720 -0800
++++ gnulib-tests/localename.c	2015-01-29 06:41:18.590919339 -0800
[email protected]@ -2644,6 +2644,9 @@
+             return "";
+           }
+         return querylocale (mask, thread_locale);
++#  elif defined(sun) || defined(__sun) || defined(__sun__)
++        extern char * __getlocalename_l(int, locale_t);
++        return __getlocalename_l (category, thread_locale);
+ #  endif
+       }
+   }
--- /dev/null	Thu Jan 01 00:00:00 1970 +0000
+++ b/components/coreutils/test/results-64.master	Thu Jan 29 09:22:33 2015 -0800
@@ -0,0 +1,2494 @@
+make[1]: Entering directory `$(@D)'
+if test -d $(SOURCE_DIR)/.git				\
+	&& git --version >/dev/null 2>&1; then			\
+  cd $(SOURCE_DIR) &&						\
+  git submodule --quiet foreach					\
+      'test "$(git rev-parse "$sha1")"			\
+	  = "$(git merge-base origin "$sha1")"'		\
+    || { echo 'maint.mk: found non-public submodule commit' >&2;	\
+	 exit 1; };						\
+else								\
+  : ;								\
+fi
+/usr/gnu/bin/make  check-recursive
+make[2]: Entering directory `$(@D)'
+Making check in po
+make[3]: Entering directory `$(@D)/po'
+make[3]: Leaving directory `$(@D)/po'
+Making check in .
+make[3]: Entering directory `$(@D)'
+/usr/gnu/bin/make  check-TESTS check-local
+make[4]: Entering directory `$(@D)'
+make[5]: Entering directory `$(@D)'
+PASS: tests/misc/help-version.sh
+inotify-race.sh: skipped test: very expensive: disabled by default
+SKIP: tests/tail-2/inotify-race.sh
+PASS: tests/misc/invalid-opt.pl
+ext3-perf.sh: skipped test: very expensive: disabled by default
+SKIP: tests/rm/ext3-perf.sh
+PASS: tests/rm/cycle.sh
+link-heap.sh: skipped test: expensive: disabled by default
+SKIP: tests/cp/link-heap.sh
+no-ctx.sh: skipped test: $CC -shared ... failed to build a shared lib
+SKIP: tests/cp/no-ctx.sh
+tty-eof.pl: this script requires Perl's Expect package >=1.11
+SKIP: tests/misc/tty-eof.pl
+PASS: tests/tail-2/inotify-hash-abuse.sh
+PASS: tests/tail-2/inotify-hash-abuse2.sh
+PASS: tests/tail-2/F-vs-missing.sh
+PASS: tests/tail-2/F-vs-rename.sh
+inotify-rotate.sh: skipped test: expensive: disabled by default
+SKIP: tests/tail-2/inotify-rotate.sh
+PASS: tests/chmod/no-x.sh
+PASS: tests/chgrp/basic.sh
+PASS: tests/rm/dangling-symlink.sh
+PASS: tests/misc/ls-time.sh
+PASS: tests/rm/d-1.sh
+PASS: tests/rm/d-2.sh
+PASS: tests/rm/d-3.sh
+PASS: tests/rm/deep-1.sh
+PASS: tests/rm/deep-2.sh
+PASS: tests/rm/dir-no-w.sh
+PASS: tests/rm/dir-nonrecur.sh
+PASS: tests/rm/dot-rel.sh
+PASS: tests/rm/isatty.sh
+PASS: tests/rm/empty-inacc.sh
+PASS: tests/rm/empty-name.pl
+PASS: tests/rm/f-1.sh
+PASS: tests/rm/fail-eacces.sh
+PASS: tests/rm/fail-eperm.xpl
+assert.sh: skipped test: very expensive: disabled by default
+SKIP: tests/tail-2/assert.sh
+hash.sh: skipped test: expensive: disabled by default
+SKIP: tests/rm/hash.sh
+PASS: tests/rm/i-1.sh
+PASS: tests/rm/i-never.sh
+PASS: tests/rm/i-no-r.sh
+PASS: tests/tail-2/infloop-1.sh
+PASS: tests/rm/ignorable.sh
+PASS: tests/rm/inaccessible.sh
+PASS: tests/rm/interactive-always.sh
+PASS: tests/rm/interactive-once.sh
+PASS: tests/rm/ir-1.sh
+PASS: tests/rm/one-file-system2.sh
+PASS: tests/rm/r-1.sh
+PASS: tests/rm/r-2.sh
+PASS: tests/rm/r-3.sh
+PASS: tests/rm/r-4.sh
+r-root.sh: skipped test: $CC -shared ... failed to build a shared lib
+SKIP: tests/rm/r-root.sh
+PASS: tests/rm/readdir-bug.sh
+PASS: tests/rm/rm1.sh
+PASS: tests/touch/empty-file.sh
+PASS: tests/rm/rm2.sh
+PASS: tests/rm/rm3.sh
+PASS: tests/rm/rm4.sh
+PASS: tests/rm/rm5.sh
+PASS: tests/rm/sunos-1.sh
+PASS: tests/rm/unread2.sh
+PASS: tests/rm/unread3.sh
+PASS: tests/rm/unreadable.pl
+PASS: tests/rm/v-slash.sh
+many-dir-entries-vs-OOM.sh: skipped test: expensive: disabled by default
+SKIP: tests/rm/many-dir-entries-vs-OOM.sh
+PASS: tests/chgrp/default-no-deref.sh
+PASS: tests/chgrp/deref.sh
+PASS: tests/chgrp/no-x.sh
+PASS: tests/chgrp/posix-H.sh
+PASS: tests/chgrp/recurse.sh
+PASS: tests/fmt/base.pl
+PASS: tests/fmt/long-line.sh
+PASS: tests/fmt/goal-option.sh
+PASS: tests/misc/env.sh
+PASS: tests/misc/ptx.pl
+PASS: tests/misc/test.pl
+PASS: tests/misc/seq.pl
+seq-long-double.sh: skipped test: this test runs only on systems with glibc and long double != double
+SKIP: tests/misc/seq-long-double.sh
+PASS: tests/misc/head.pl
+PASS: tests/misc/head-elide-tail.pl
+tail-n0f.sh: skipped test:
+SKIP: tests/tail-2/tail-n0f.sh
+PASS: tests/misc/ls-misc.pl
+PASS: tests/misc/date.pl
+PASS: tests/misc/date-next-dow.pl
+PASS: tests/misc/ptx-overrun.sh
+PASS: tests/misc/xstrtol.pl
+PASS: tests/tail-2/pid.sh
+PASS: tests/misc/od.pl
+PASS: tests/misc/od-endian.sh
+PASS: tests/misc/od-float.sh
+PASS: tests/misc/mktemp.pl
+arch.sh: skipped test: required program(s) not built
+SKIP: tests/misc/arch.sh
+PASS: tests/misc/join.pl
+PASS: tests/pr/pr-tests.pl
+PASS: tests/misc/pwd-option.sh
+PASS: tests/misc/chcon-fail.sh
+coreutils.sh: skipped test: multicall binary is disabled
+SKIP: tests/misc/coreutils.sh
+PASS: tests/misc/cut.pl
+PASS: tests/misc/cut-huge-range.sh
+PASS: tests/misc/wc.pl
+PASS: tests/misc/wc-files0-from.pl
+PASS: tests/misc/wc-files0.sh
+PASS: tests/misc/wc-parallel.sh
+cat-proc.sh: skipped test: no /proc/cpuinfo
+SKIP: tests/misc/cat-proc.sh
+PASS: tests/misc/cat-buf.sh
+PASS: tests/misc/base64.pl
+PASS: tests/misc/basename.pl
+PASS: tests/misc/close-stdout.sh
+PASS: tests/misc/chroot-fail.sh
+PASS: tests/misc/comm.pl
+PASS: tests/misc/csplit.sh
+PASS: tests/misc/csplit-1000.sh
+PASS: tests/misc/csplit-heap.sh
+PASS: tests/misc/csplit-suppress-matched.pl
+PASS: tests/misc/date-sec.sh
+PASS: tests/misc/dircolors.pl
+PASS: tests/misc/dirname.pl
+PASS: tests/misc/env-null.sh
+PASS: tests/misc/expand.pl
+PASS: tests/misc/expr.pl
+PASS: tests/misc/factor.pl
+PASS: tests/misc/false-status.sh
+PASS: tests/misc/fold.pl
+PASS: tests/misc/groups-dash.sh
+PASS: tests/misc/groups-version.sh
+PASS: tests/misc/head-c.sh
+PASS: tests/misc/head-pos.sh
+head-write-error.sh: skipped test: /dev/full is required
+SKIP: tests/misc/head-write-error.sh
+PASS: tests/misc/md5sum.pl
+PASS: tests/misc/md5sum-bsd.sh
+PASS: tests/misc/md5sum-newline.pl
+PASS: tests/misc/md5sum-parallel.sh
+PASS: tests/misc/mknod.sh
+PASS: tests/misc/nice.sh
+PASS: tests/misc/nice-fail.sh
+PASS: tests/misc/nl.sh
+PASS: tests/misc/nohup.sh
+PASS: tests/misc/nproc-avail.sh
+PASS: tests/misc/nproc-positive.sh
+PASS: tests/misc/numfmt.pl
+PASS: tests/misc/od-N.sh
+PASS: tests/misc/od-multiple-t.sh
+PASS: tests/misc/od-x8.sh
+PASS: tests/misc/paste.pl
+PASS: tests/misc/pathchk1.sh
+PASS: tests/misc/printenv.sh
+PASS: tests/misc/printf.sh
+PASS: tests/misc/printf-cov.pl
+PASS: tests/misc/printf-hex.sh
+PASS: tests/misc/printf-surprise.sh
+PASS: tests/misc/pwd-long.sh
+PASS: tests/misc/readlink-fp-loop.sh
+PASS: tests/misc/readlink-root.sh
+PASS: tests/misc/realpath.sh
+PASS: tests/misc/runcon-no-reorder.sh
+PASS: tests/misc/sha1sum.pl
+PASS: tests/misc/sha1sum-vec.pl
+PASS: tests/misc/sha224sum.pl
+PASS: tests/misc/sha256sum.pl
+PASS: tests/misc/sha384sum.pl
+PASS: tests/misc/sha512sum.pl
+PASS: tests/misc/shred-exact.sh
+PASS: tests/misc/shred-negative.sh
+PASS: tests/misc/shred-passes.sh
+PASS: tests/misc/shred-remove.sh
+PASS: tests/misc/shuf.sh
+shuf-reservoir.sh: skipped test: expensive: disabled by default
+SKIP: tests/misc/shuf-reservoir.sh
+PASS: tests/misc/sort.pl
+sort-benchmark-random.sh: skipped test: very expensive: disabled by default
+SKIP: tests/misc/sort-benchmark-random.sh
+PASS: tests/misc/sort-compress.sh
+sort-compress-hang.sh: skipped test: very expensive: disabled by default
+SKIP: tests/misc/sort-compress-hang.sh
+sort-compress-proc.sh: skipped test: expensive: disabled by default
+SKIP: tests/misc/sort-compress-proc.sh
+PASS: tests/misc/sort-continue.sh
+PASS: tests/misc/sort-debug-keys.sh
+PASS: tests/misc/sort-debug-warn.sh
+PASS: tests/misc/sort-discrim.sh
+PASS: tests/misc/sort-files0-from.pl
+PASS: tests/misc/sort-float.sh
+PASS: tests/misc/sort-merge.pl
+PASS: tests/misc/sort-merge-fdlimit.sh
+sort-month.sh: skipped test: The locale utility is not present
+SKIP: tests/misc/sort-month.sh
+PASS: tests/misc/sort-exit-early.sh
+PASS: tests/misc/sort-rand.sh
+sort-spinlock-abuse.sh: skipped test: very expensive: disabled by default
+SKIP: tests/misc/sort-spinlock-abuse.sh
+sort-stale-thread-mem.sh: skipped test: very expensive: disabled by default
+SKIP: tests/misc/sort-stale-thread-mem.sh
+PASS: tests/misc/sort-unique.sh
+PASS: tests/misc/sort-unique-segv.sh
+PASS: tests/misc/sort-version.sh
+PASS: tests/misc/sort-NaN-infloop.sh
+sort-u-FMR.sh: skipped test: requires a working valgrind
+SKIP: tests/misc/sort-u-FMR.sh
+PASS: tests/split/filter.sh
+PASS: tests/split/suffix-auto-length.sh
+PASS: tests/split/suffix-length.sh
+PASS: tests/split/additional-suffix.sh
+PASS: tests/split/b-chunk.sh
+PASS: tests/split/fail.sh
+PASS: tests/split/lines.sh
+PASS: tests/split/line-bytes.sh
+PASS: tests/split/l-chunk.sh
+PASS: tests/split/r-chunk.sh
+PASS: tests/split/numeric.sh
+PASS: tests/split/guard-input.sh
+PASS: tests/misc/stat-birthtime.sh
+PASS: tests/misc/stat-fmt.sh
+PASS: tests/misc/stat-hyphen.sh
+PASS: tests/misc/stat-mount.sh
+PASS: tests/misc/stat-nanoseconds.sh
+PASS: tests/misc/stat-printf.pl
+PASS: tests/misc/stat-slash.sh
+PASS: tests/misc/stdbuf.sh
+PASS: tests/misc/stty.sh
+PASS: tests/misc/stty-invalid.sh
+stty-pairs.sh: skipped test: expensive: disabled by default
+SKIP: tests/misc/stty-pairs.sh
+PASS: tests/misc/stty-row-col.sh
+PASS: tests/misc/sum.pl
+PASS: tests/misc/sum-sysv.sh
+PASS: tests/misc/tac.pl
+tac-continue.sh: skipped test: FULL_PARTITION_TMPDIR not defined
+SKIP: tests/misc/tac-continue.sh
+PASS: tests/misc/tac-2-nonseekable.sh
+PASS: tests/misc/tail.pl
+PASS: tests/misc/tee.sh
+PASS: tests/misc/tee-dash.sh
+PASS: tests/misc/test-diag.pl
+PASS: tests/misc/timeout.sh
+PASS: tests/misc/timeout-blocked.pl
+timeout-group.sh: skipped test: setsid required to control groups
+SKIP: tests/misc/timeout-group.sh
+PASS: tests/misc/timeout-parameters.sh
+PASS: tests/misc/tr.pl
+PASS: tests/misc/tr-case-class.sh
+PASS: tests/misc/truncate-dangling-symlink.sh
+PASS: tests/misc/truncate-dir-fail.sh
+PASS: tests/misc/truncate-fail-diag.sh
+PASS: tests/misc/truncate-fifo.sh
+PASS: tests/misc/truncate-no-create-missing.sh
+PASS: tests/misc/truncate-overflow.sh
+PASS: tests/misc/truncate-parameters.sh
+PASS: tests/misc/truncate-relative.sh
+PASS: tests/misc/tsort.pl
+PASS: tests/misc/unexpand.pl
+PASS: tests/misc/uniq.pl
+PASS: tests/misc/uniq-perf.sh
+xattr.sh: skipped test: coreutils built without xattr support
+SKIP: tests/misc/xattr.sh
+PASS: tests/tail-2/wait.sh
+PASS: tests/tail-2/retry.sh
+PASS: tests/tail-2/symlink.sh
+PASS: tests/chmod/c-option.sh
+PASS: tests/chmod/equal-x.sh
+PASS: tests/chmod/equals.sh
+PASS: tests/chmod/inaccessible.sh
+PASS: tests/chmod/octal.sh
+PASS: tests/chmod/setgid.sh
+PASS: tests/chmod/silent.sh
+PASS: tests/chmod/thru-dangling.sh
+PASS: tests/chmod/umask-x.sh
+PASS: tests/chmod/usage.sh
+PASS: tests/chown/deref.sh
+PASS: tests/chown/preserve-root.sh
+separator.sh: skipped test: group 'staff' not biunique:  staff::10:,staff::10:aadamson,aanjelee,aardelea,abai,abetshli,abmohamm,aefreche,aer,afomin,afrechet,aglasman,aguttman,aguzovsk,ahajipou,ahgross,ahornik,akatarki,akendzio,akoroste,albatem,aletan,amasand,amcphee,amikheev,amkeshar,amodarre,amullend,amurillo,ananseth,andyande,aneduva,anpeters,anprabha,anshjain,anshushr,anubhatn,anupamsr,aparkman,apnath,apocock,aposledo,arlevin,aroh,asaskhan,ashassan,asibal,asommere,asultano,atreece,avempaty,aywang,azhebel,bakinci,bbaretc,bbeck,bboppana,bburkhar,bchapman,bcliu,bdanell,bebarret,bfa,bgstott,bhavespa,bhueston,bmichels,bmunroe,bnaugle,bnesheim,boconnor,bpbrady,bpham,brdoyle,brlouis,bsitu,caquick,cbalon,cbanerje,cbhaase,ccastil,ccgonzal,cchurch,cduff,cfang,cflood,chanlian,chaofewu,chaoy,charsha,chebrard,chilai,cholson,chpatel,chrbrown,chrlau,chrowe,chzheng,ciyu,ckolner,ckunzman,ckutler,clhsiao,clrussel,cmckee,cmhamilt,cmott,cratnaku,crinaldo,csteed,ctissot,ctuztas,cwesley,dabautis,daellis,davidngu,dawphill,dbanman,dbeaureg,dcopelan,dcwoods,ddaniel,ddice,ddimeo,ddonahue,debsinha,deccles,desagar,dfinberg,dfjoyce,dglove,dgove,dgrieve,dgubkin,dhartwel,dhpillai,dhwu,dice,djlee,dkonecny,dkostova,dlindt,dlrobins,dlutoff,dmcox,dmeirowi,dmelnike,dminer,dmorrier,dnbernar,doxiao,dselliot,dsilaev,dsimonaz,dswoo,dtfung,dtsai,dyjiao,echenede,edcox,eflores,ejburns,ejendroc,eleponn,elirodri,elocatel,ephilipp,esharaka,esteubin,etjandra,euloh,ewood,fabiop,fdorson,fenzhang,fgotwald,flyoung,frakoczi,ftouserk,gabernar,gagordon,gandru,gangwa,gasmith,gbellato,gcash,gdmarsha,gekosuru,ggnanapr,ggrannis,ggrohosk,ghares,gjumper,gkchu,gkechrio,gkennedy,gledesma,glevinsk,glsteele,gmcollin,gmurr,gparente,gplouffe,gradams,griddle,griner,grpatter,guzhang,haipeng,haixiao,haozyang,hcarr,hhaque,hkalley,hogle,hongzh,hovu,hoyau,hperumal,hramanuj,hramaswa,hsilin,hszyszko,huahuang,huapzhou,huizwang,hyw,hzhangad,ibason,ichalmer,idergali,igueye,irahmed,isavytsk,iwagner,jabrock,jacaron,jackerle,jadong,jamejone,jandeel,jarnou,jbarreh,jbartle,jbeloro,jbenoit,jbochsle,jborzuch,jbrooks,jbsantos,jcervenk,jcoomes,jdarmstr,jddobson,jdebais,jdemend,jdharper,jdunham,jealexan,jechi,jechu,jfialli,jgemmell,jgialluc,jhanders,jiahche,jiander,jidavid,jijising,jinghua,jizraele,jjamberd,jjhan,jjzhu,jkerwin,jkopinsk,jkotamra,jleser,jlowfung,jlpriest,jls,jmasamit,jmattiso,jmohd,jnerl,johhoffm,jokaufma,josorio,joverga,jpcampbe,jpikus,jpompa,jprodrig,jravelli,jrgalvin,julam,juschulz,jwaldear,jwatkins,jwestfal,jwingerd,jwspence,jyonair,jzong,kbeckers,kcallagh,kenng,kentchan,kesong,keward,kexcoffi,kgrant,kgrauste,kgrucci,kichung,kiranpat,kjbellew,kkellerm,kmaekawa,kmarble,kmjohans,kmkinnea,kmorneau,kmwillia,kriramac,krkasibh,ksauter,kschaffe,ksengoda,ktachiba,kunsinha,kwalls,kwoodlin,lafrost,larbouzo,latsharm,lbanita,ldemichi,lhesch,liqu,lizhzhao,ljanders,ljungman,lkrispen,lladwig,lmerwick,lmesnik,lmmiller,lnoorder,lozou,lquan,lrossele,lshikhva,ltharris,lwudali,lzalzala,mabrady,mamanoha,marawils,mares,margmill,mchinnai,mcwan,mdemertz,mdignum,melgebal,mfreda,mgilbode,mgrebac,mgreenbe,mhaley,mherlihy,mhkanda,michhaye,miflemi,mimcmah,minmai,mjamati,mjburns,mjotwani,mkos,mkossa,mkyoung,mlimprec,mluis,mluttrel,mmccomb,mmdohert,mmeswani,mmhunter,mminasan,mmodolo,mmshah,momoahme,mparissi,mpawlan,mpoh,mppatel,mrkonda,msmittle,msmoir,msolovie,mtvo,mulloa,mvatkina,mvjoshi,mwhittak,mwick,nagmuthu,nawan,ndkikker,nfotaria,nhamamot,nhildebr,nidbhati,nimurph,nislam,nkurudi,nltran,nluu,nmoon,nodonnel,npinckne,nsheeley,nsidde,olee,osharwoo,ostrizhe,pallenba,pamberg,pastepan,pbhojwan,pcashman,pchulada,pdiligen,pdmiller,pducjac,pgreene,phendley,phgamba,phohense,pjiricka,pjjordan,pkavan,plabrecq,ploewens,pmacko,pmemishi,potan,pramnata,prasanda,prassubr,pravarsh,prkabra,progier,protker,prrace,pslam,pstepano,ptirumal,ptrobins,pvinh,pyoung,radhbai,rajmurth,rarapate,ravising,rbharol,rblewitt,rcalnan,rcloke,rdoran,revsrini,rgallard,rgillmor,rhouk,riamin,rkbysani,rkitain,rkrathi,rkrawitz,rlubke,rmains,rmaldona,rmarco,rmarigny,rmatous,rmng,rmonzill,rmordani,rparks,rpecorar,rpgoyal,rprak,rramsey,rranade,rretheme,rriggs,rshoemak,rsmaeda,rsoconne,rsrikuma,rtcaldwe,rtlee,ruetang,rvchadal,sabruzi,saisai,samuller,sangsinh,santjadh,sberthol,sbhusara,sbuckmel,sdimilla,sduloutr,sdungar,sehring,seokjkim,sevani,sfraioli,sgouvern,sgovardh,sguidon,shanghua,sharudde,shausman,shdiveka,shengwan,shenxu,shhegde,shihhua,shjin,shlilin,shommel,shsrikan,shyip,sidicula,sietrgrs,sijenki,sinli,sjayadev,sjchan,skadaba,skapulki,skonchad,slakkara,slokappa,smaguin,smanga,smanuel,smatikov,smcarter,smckinty,smcooper,smemery,sohg,sokannan,spaydavo,spbrydon,spcaruso,specavar,spericas,sqlee,sriniram,sriragop,srkaturi,srrgrs,srsrnata,ssapozhn,ssevozen,sshahed,sshakib,ssistare,ssnandur,sssun,stalluri,steweber,stflores,stgreen,stwolf,subrnata,suchowdh,suwei,svadlapa,swaritz,swbiswas,swbutler,swvenu,tacheung,taclin,tale,tarakel,tbarbaro,tbarr,tbordaz,tcarmody,tcdaly,tcfische,tdontje,tedhong,timf,tiobrie,tkenvill,tkostyas,tkrodrig,tlbrown,tlharris,tmcginn,tmihinto,tmomen,tprintez,tpyon,tread,tsesselm,tshabat,tsquier,ttle,twittsac,tyao,ugaston,usabada,usaha,vagaveed,valexeen,vavishal,vbalu,vdanushe,vijbalas,vimvargh,vjhu,vkraemer,vkryvel,vlaschen,vluchang,vmichael,vmula,vntruong,vrowe,vsmdvt,vsparmar,wdjohnst,wgerner,winouye,wivu,wlichte,wonchoi,wsantoso,wtruong,wychen,wyork,xiaolshi,xiw,yicchen,yich,yinshen,yiwwu,yixia,ykamiya,ylev,ypolssa,yumliu,yyoli,yzhzhao,zbhatti,zhengzh,zqian,zuqin,zutang,
+SKIP: tests/chown/separator.sh
+PASS: tests/cp/abuse.sh
+acl.sh: skipped test: This test requires getfacl and setfacl.
+SKIP: tests/cp/acl.sh
+PASS: tests/cp/attr-existing.sh
+PASS: tests/cp/backup-1.sh
+PASS: tests/cp/backup-dir.sh
+PASS: tests/cp/backup-is-src.sh
+PASS: tests/cp/cp-HL.sh
+PASS: tests/cp/cp-deref.sh
+PASS: tests/cp/cp-i.sh
+PASS: tests/cp/cp-mv-backup.sh
+PASS: tests/cp/cp-parents.sh
+PASS: tests/cp/deref-slink.sh
+PASS: tests/cp/dir-rm-dest.sh
+PASS: tests/cp/dir-slash.sh
+PASS: tests/cp/dir-vs-file.sh
+PASS: tests/cp/existing-perm-dir.sh
+PASS: tests/cp/existing-perm-race.sh
+PASS: tests/cp/fail-perm.sh
+fiemap-empty.sh: skipped test: disabled for now
+SKIP: tests/cp/fiemap-empty.sh
+fiemap-FMR.sh: skipped test: requires a working valgrind
+SKIP: tests/cp/fiemap-FMR.sh
+fiemap-perf.sh: skipped test: this file system lacks FIEMAP support
+SKIP: tests/cp/fiemap-perf.sh
+fiemap-2.sh: skipped test: this file system lacks FIEMAP support
+SKIP: tests/cp/fiemap-2.sh
+PASS: tests/cp/file-perm-race.sh
+PASS: tests/cp/into-self.sh
+PASS: tests/cp/link.sh
+PASS: tests/cp/link-deref.sh
+PASS: tests/cp/link-no-deref.sh
+PASS: tests/cp/link-preserve.sh
+PASS: tests/cp/link-symlink.sh
+nfs-removal-race.sh: skipped test: $CC -shared ... failed to build a shared lib
+SKIP: tests/cp/nfs-removal-race.sh
+PASS: tests/cp/no-deref-link1.sh
+PASS: tests/cp/no-deref-link2.sh
+PASS: tests/cp/no-deref-link3.sh
+PASS: tests/cp/parent-perm.sh
+PASS: tests/cp/parent-perm-race.sh
+perm.sh: skipped test: very expensive: disabled by default
+SKIP: tests/cp/perm.sh
+PASS: tests/cp/preserve-2.sh
+PASS: tests/cp/preserve-link.sh
+PASS: tests/cp/preserve-mode.sh
+PASS: tests/cp/preserve-slink-time.sh
+proc-short-read.sh: skipped test: your system lacks /proc/kallsyms
+SKIP: tests/cp/proc-short-read.sh
+PASS: tests/cp/proc-zero-len.sh
+PASS: tests/cp/r-vs-symlink.sh
+PASS: tests/cp/reflink-auto.sh
+PASS: tests/cp/reflink-perm.sh
+PASS: tests/cp/same-file.sh
+PASS: tests/cp/slink-2-slink.sh
+PASS: tests/cp/sparse.sh
+PASS: tests/cp/sparse-to-pipe.sh
+PASS: tests/cp/special-f.sh
+PASS: tests/cp/src-base-dot.sh
+PASS: tests/cp/symlink-slash.sh
+PASS: tests/cp/thru-dangling.sh
+PASS: tests/df/header.sh
+PASS: tests/df/df-P.sh
+PASS: tests/df/df-output.sh
+df-symlink.sh: skipped test:
+SKIP: tests/df/df-symlink.sh
+PASS: tests/df/unreadable.sh
+PASS: tests/df/total-unprocessed.sh
+no-mtab-status.sh: skipped test: $CC -shared ... failed to build a shared lib
+SKIP: tests/df/no-mtab-status.sh
+skip-duplicates.sh: skipped test: $CC -shared ... failed to build a shared lib
+SKIP: tests/df/skip-duplicates.sh
+skip-rootfs.sh: skipped test: no rootfs in mtab
+SKIP: tests/df/skip-rootfs.sh
+PASS: tests/dd/ascii.sh
+direct.sh: skipped test: this file system lacks support for O_DIRECT
+SKIP: tests/dd/direct.sh
+PASS: tests/dd/misc.sh
+PASS: tests/dd/no-allocate.sh
+PASS: tests/dd/nocache.sh
+PASS: tests/dd/not-rewound.sh
+PASS: tests/dd/reblock.sh
+PASS: tests/dd/skip-seek.pl
+PASS: tests/dd/skip-seek2.sh
+PASS: tests/dd/bytes.sh
+PASS: tests/dd/skip-seek-past-file.sh
+PASS: tests/dd/sparse.sh
+PASS: tests/dd/stderr.sh
+PASS: tests/dd/unblock.pl
+PASS: tests/dd/unblock-sync.sh
+PASS: tests/df/total-verify.sh
+2g.sh: skipped test: very expensive: disabled by default
+SKIP: tests/du/2g.sh
+PASS: tests/du/8gb.sh
+PASS: tests/du/basic.sh
+PASS: tests/du/bigtime.sh
+PASS: tests/du/deref.sh
+PASS: tests/du/deref-args.sh
+PASS: tests/du/exclude.sh
+fd-leak.sh: skipped test: expensive: disabled by default
+SKIP: tests/du/fd-leak.sh
+PASS: tests/du/files0-from.pl
+PASS: tests/du/files0-from-dir.sh
+PASS: tests/du/hard-link.sh
+PASS: tests/du/inacc-dest.sh
+PASS: tests/du/inacc-dir.sh
+PASS: tests/du/inaccessible-cwd.sh
+PASS: tests/du/inodes.sh
+PASS: tests/du/long-from-unreadable.sh
+PASS: tests/du/long-sloop.sh
+PASS: tests/du/max-depth.sh
+move-dir-while-traversing.sh: skipped test: python inotify package not installed
+SKIP: tests/du/move-dir-while-traversing.sh
+PASS: tests/du/no-deref.sh
+PASS: tests/du/no-x.sh
+PASS: tests/du/one-file-system.sh
+PASS: tests/du/restore-wd.sh
+PASS: tests/du/slash.sh
+threshold.sh: skipped test: apparent size of a directory is smaller than 4 bytes
+SKIP: tests/du/threshold.sh
+PASS: tests/du/trailing-slash.sh
+PASS: tests/du/two-args.sh
+gnu-zero-uids.sh: skipped test: not running on GNU/Hurd
+SKIP: tests/id/gnu-zero-uids.sh
+no-context.sh: skipped test: this system lacks SELinux support
+SKIP: tests/id/no-context.sh
+context.sh: skipped test: this system lacks SELinux support
+SKIP: tests/id/context.sh
+PASS: tests/id/uid.sh
+setgid.sh: skipped test: must be run as root
+SKIP: tests/id/setgid.sh
+PASS: tests/id/zero.sh
+smack.sh: skipped test: this system lacks SMACK support
+SKIP: tests/id/smack.sh
+PASS: tests/install/basic-1.sh
+PASS: tests/install/create-leading.sh
+PASS: tests/install/d-slashdot.sh
+PASS: tests/install/install-C.sh
+install-C-selinux.sh: skipped test: this system lacks SELinux support
+SKIP: tests/install/install-C-selinux.sh
+PASS: tests/install/strip-program.sh
+PASS: tests/install/trap.sh
+PASS: tests/ln/backup-1.sh
+PASS: tests/ln/hard-backup.sh
+PASS: tests/ln/hard-to-sym.sh
+PASS: tests/ln/misc.sh
+PASS: tests/ln/relative.sh
+PASS: tests/ln/sf-1.sh
+PASS: tests/ln/slash-decorated-nonexistent-dest.sh
+PASS: tests/ln/target-1.sh
+PASS: tests/ls/abmon-align.sh
+PASS: tests/ls/block-size.sh
+PASS: tests/ls/color-clear-to-eol.sh
+PASS: tests/ls/color-dtype-dir.sh
+PASS: tests/ls/color-norm.sh
+PASS: tests/ls/color-term.sh
+PASS: tests/ls/dangle.sh
+PASS: tests/ls/dired.sh
+PASS: tests/ls/file-type.sh
+PASS: tests/ls/follow-slink.sh
+getxattr-speedup.sh: skipped test: $CC -shared ... failed to build a shared lib
+SKIP: tests/ls/getxattr-speedup.sh
+PASS: tests/ls/infloop.sh
+PASS: tests/ls/inode.sh
+PASS: tests/ls/m-option.sh
+PASS: tests/ls/multihardlink.sh
+PASS: tests/ls/no-arg.sh
+no-cap.sh: skipped test: no strace program
+SKIP: tests/ls/no-cap.sh
+PASS: tests/ls/proc-selinux-segfault.sh
+PASS: tests/ls/readdir-mountpoint-inode.sh
+PASS: tests/ls/recursive.sh
+PASS: tests/ls/root-rel-symlink-color.sh
+PASS: tests/ls/rt-1.sh
+slink-acl.sh: skipped test: setfacl does not work on the current file system
+SKIP: tests/ls/slink-acl.sh
+stat-dtype.sh: skipped test: '.' is not on a suitable file system for this test
+SKIP: tests/ls/stat-dtype.sh
+PASS: tests/ls/stat-failed.sh
+stat-free-color.sh: skipped test: no strace program
+SKIP: tests/ls/stat-free-color.sh
+stat-free-symlinks.sh: skipped test: no strace program
+SKIP: tests/ls/stat-free-symlinks.sh
+PASS: tests/ls/stat-vs-dirent.sh
+PASS: tests/ls/symlink-slash.sh
+PASS: tests/ls/time-style-diag.sh
+PASS: tests/ls/x-option.sh
+PASS: tests/mkdir/p-1.sh
+PASS: tests/mkdir/p-2.sh
+PASS: tests/mkdir/p-3.sh
+p-acl.sh: skipped test: setfacl does not work on the current file system
+SKIP: tests/mkdir/p-acl.sh
+PASS: tests/mkdir/p-slashdot.sh
+PASS: tests/mkdir/p-thru-slink.sh
+PASS: tests/mkdir/p-v.sh
+PASS: tests/mkdir/parents.sh
+PASS: tests/mkdir/perm.sh
+selinux.sh: skipped test: this system lacks SELinux support
+SKIP: tests/mkdir/selinux.sh
+restorecon.sh: skipped test: this system lacks SELinux support
+SKIP: tests/mkdir/restorecon.sh
+PASS: tests/mkdir/special-1.sh
+PASS: tests/mkdir/t-slash.sh
+smack-no-root.sh: skipped test: this system lacks SMACK support
+SKIP: tests/mkdir/smack-no-root.sh
+smack-root.sh: skipped test: this system lacks SMACK support
+SKIP: tests/mkdir/smack-root.sh
+acl.sh: skipped test: This test requires getfacl and setfacl.
+SKIP: tests/mv/acl.sh
+atomic.sh: skipped test: no strace program
+SKIP: tests/mv/atomic.sh
+atomic2.sh: skipped test: no strace program
+SKIP: tests/mv/atomic2.sh
+PASS: tests/mv/backup-dir.sh
+PASS: tests/mv/backup-is-src.sh
+PASS: tests/mv/childproof.sh
+PASS: tests/mv/diag.sh
+PASS: tests/mv/dir-file.sh
+PASS: tests/mv/dir2dir.sh
+PASS: tests/mv/dup-source.sh
+PASS: tests/mv/force.sh
+PASS: tests/mv/hard-2.sh
+PASS: tests/mv/hard-3.sh
+PASS: tests/mv/hard-4.sh
+PASS: tests/mv/hard-link-1.sh
+PASS: tests/mv/hard-verbose.sh
+PASS: tests/mv/i-1.pl
+PASS: tests/mv/i-2.sh
+PASS: tests/mv/i-3.sh
+PASS: tests/mv/i-4.sh
+PASS: tests/mv/i-5.sh
+PASS: tests/mv/i-link-no.sh
+PASS: tests/mv/into-self.sh
+PASS: tests/mv/into-self-2.sh
+PASS: tests/mv/into-self-3.sh
+PASS: tests/mv/into-self-4.sh
+leak-fd.sh: skipped test: expensive: disabled by default
+SKIP: tests/mv/leak-fd.sh
+PASS: tests/mv/mv-n.sh
+PASS: tests/mv/mv-special-1.sh
+PASS: tests/mv/no-target-dir.sh
+PASS: tests/mv/part-fail.sh
+PASS: tests/mv/part-hardlink.sh
+PASS: tests/mv/part-rename.sh
+PASS: tests/mv/part-symlink.sh
+PASS: tests/mv/partition-perm.sh
+PASS: tests/mv/perm-1.sh
+PASS: tests/mv/symlink-onto-hardlink.sh
+symlink-onto-hardlink-to-self.sh: skipped test: your kernel or file system cannot create a hard link to a symlink
+SKIP: tests/mv/symlink-onto-hardlink-to-self.sh
+PASS: tests/mv/to-symlink.sh
+PASS: tests/mv/trailing-slash.sh
+PASS: tests/mv/update.sh
+PASS: tests/readlink/can-e.sh
+PASS: tests/readlink/can-f.sh
+PASS: tests/readlink/can-m.sh
+PASS: tests/readlink/multi.sh
+PASS: tests/readlink/rl-1.sh
+PASS: tests/rmdir/fail-perm.sh
+PASS: tests/rmdir/ignore.sh
+PASS: tests/rmdir/t-slash.sh
+assert-2.sh: skipped test: very expensive: disabled by default
+SKIP: tests/tail-2/assert-2.sh
+big-4gb.sh: skipped test: expensive: disabled by default
+SKIP: tests/tail-2/big-4gb.sh
+PASS: tests/tail-2/flush-initial.sh
+PASS: tests/tail-2/follow-name.sh
+PASS: tests/tail-2/follow-stdin.sh
+PASS: tests/tail-2/pipe-f.sh
+PASS: tests/tail-2/pipe-f2.sh
+PASS: tests/tail-2/proc-ksyms.sh
+PASS: tests/tail-2/start-middle.sh
+PASS: tests/touch/60-seconds.sh
+PASS: tests/touch/dangling-symlink.sh
+PASS: tests/touch/dir-1.sh
+PASS: tests/touch/fail-diag.sh
+PASS: tests/touch/fifo.sh
+PASS: tests/touch/no-create-missing.sh
+PASS: tests/touch/no-dereference.sh
+PASS: tests/touch/no-rights.sh
+PASS: tests/touch/not-owner.sh
+PASS: tests/touch/obsolescent.sh
+PASS: tests/touch/read-only.sh
+PASS: tests/touch/relative.sh
+PASS: tests/touch/trailing-slash.sh
+basic.sh: skipped test: must be run as root
+SKIP: tests/chown/basic.sh
+cp-a-selinux.sh: skipped test: must be run as root
+SKIP: tests/cp/cp-a-selinux.sh
+preserve-gid.sh: skipped test: must be run as root
+SKIP: tests/cp/preserve-gid.sh
+special-bits.sh: skipped test: must be run as root
+SKIP: tests/cp/special-bits.sh
+cp-mv-enotsup-xattr.sh: skipped test: must be run as root
+SKIP: tests/cp/cp-mv-enotsup-xattr.sh
+capability.sh: skipped test: must be run as root
+SKIP: tests/cp/capability.sh
+sparse-fiemap.sh: skipped test: current file system has insufficient FIEMAP support
+SKIP: tests/cp/sparse-fiemap.sh
+skip-seek-past-dev.sh: skipped test: must be run as root
+SKIP: tests/dd/skip-seek-past-dev.sh
+problematic-chars.sh: skipped test: must be run as root
+SKIP: tests/df/problematic-chars.sh
+over-mount-device.sh: skipped test: must be run as root
+SKIP: tests/df/over-mount-device.sh
+bind-mount-dir-cycle.sh: skipped test: must be run as root
+SKIP: tests/du/bind-mount-dir-cycle.sh
+install-C-root.sh: skipped test: must be run as root
+SKIP: tests/install/install-C-root.sh
+capability.sh: skipped test: must be run as root
+SKIP: tests/ls/capability.sh
+nameless-uid.sh: skipped test: must be run as root
+SKIP: tests/ls/nameless-uid.sh
+chcon.sh: skipped test: must be run as root
+SKIP: tests/misc/chcon.sh
+chroot-credentials.sh: skipped test: must be run as root
+SKIP: tests/misc/chroot-credentials.sh
+selinux.sh: skipped test: must be run as root
+SKIP: tests/misc/selinux.sh
+truncate-owned-by-other.sh: skipped test: must be run as root
+SKIP: tests/misc/truncate-owned-by-other.sh
+writable-under-readonly.sh: skipped test: must be run as root
+SKIP: tests/mkdir/writable-under-readonly.sh
+sticky-to-xpart.sh: skipped test: must be run as root
+SKIP: tests/mv/sticky-to-xpart.sh
+fail-2eperm.sh: skipped test: must be run as root
+SKIP: tests/rm/fail-2eperm.sh
+no-give-up.sh: skipped test: must be run as root
+SKIP: tests/rm/no-give-up.sh
+one-file-system.sh: skipped test: must be run as root
+SKIP: tests/rm/one-file-system.sh
+read-only.sh: skipped test: must be run as root
+SKIP: tests/rm/read-only.sh
+append-only.sh: skipped test: must be run as root
+SKIP: tests/tail-2/append-only.sh
+now-owned-by-other.sh: skipped test: must be run as root
+SKIP: tests/touch/now-owned-by-other.sh
+/usr/gnu/bin/mkdir -p tests/factor
+/bin/bash $(SOURCE_DIR)/tests/factor/create-test.sh tests/factor/t00.sh \
+  $(SOURCE_DIR)/tests/factor/run.sh > tests/factor/t00.sh-t
+chmod a+x tests/factor/t00.sh-t
+mv -f tests/factor/t00.sh-t tests/factor/t00.sh
+t00.sh: skipped test: very expensive: disabled by default
+SKIP: tests/factor/t00.sh
+/usr/gnu/bin/mkdir -p tests/factor
+/bin/bash $(SOURCE_DIR)/tests/factor/create-test.sh tests/factor/t01.sh \
+  $(SOURCE_DIR)/tests/factor/run.sh > tests/factor/t01.sh-t
+chmod a+x tests/factor/t01.sh-t
+mv -f tests/factor/t01.sh-t tests/factor/t01.sh
+t01.sh: skipped test: very expensive: disabled by default
+SKIP: tests/factor/t01.sh
+/usr/gnu/bin/mkdir -p tests/factor
+/bin/bash $(SOURCE_DIR)/tests/factor/create-test.sh tests/factor/t02.sh \
+  $(SOURCE_DIR)/tests/factor/run.sh > tests/factor/t02.sh-t
+chmod a+x tests/factor/t02.sh-t
+mv -f tests/factor/t02.sh-t tests/factor/t02.sh
+t02.sh: skipped test: very expensive: disabled by default
+SKIP: tests/factor/t02.sh
+/usr/gnu/bin/mkdir -p tests/factor
+/bin/bash $(SOURCE_DIR)/tests/factor/create-test.sh tests/factor/t03.sh \
+  $(SOURCE_DIR)/tests/factor/run.sh > tests/factor/t03.sh-t
+chmod a+x tests/factor/t03.sh-t
+mv -f tests/factor/t03.sh-t tests/factor/t03.sh
+t03.sh: skipped test: very expensive: disabled by default
+SKIP: tests/factor/t03.sh
+/usr/gnu/bin/mkdir -p tests/factor
+/bin/bash $(SOURCE_DIR)/tests/factor/create-test.sh tests/factor/t04.sh \
+  $(SOURCE_DIR)/tests/factor/run.sh > tests/factor/t04.sh-t
+chmod a+x tests/factor/t04.sh-t
+mv -f tests/factor/t04.sh-t tests/factor/t04.sh
+t04.sh: skipped test: very expensive: disabled by default
+SKIP: tests/factor/t04.sh
+/usr/gnu/bin/mkdir -p tests/factor
+/bin/bash $(SOURCE_DIR)/tests/factor/create-test.sh tests/factor/t05.sh \
+  $(SOURCE_DIR)/tests/factor/run.sh > tests/factor/t05.sh-t
+chmod a+x tests/factor/t05.sh-t
+mv -f tests/factor/t05.sh-t tests/factor/t05.sh
+t05.sh: skipped test: very expensive: disabled by default
+SKIP: tests/factor/t05.sh
+/usr/gnu/bin/mkdir -p tests/factor
+/bin/bash $(SOURCE_DIR)/tests/factor/create-test.sh tests/factor/t06.sh \
+  $(SOURCE_DIR)/tests/factor/run.sh > tests/factor/t06.sh-t
+chmod a+x tests/factor/t06.sh-t
+mv -f tests/factor/t06.sh-t tests/factor/t06.sh
+t06.sh: skipped test: very expensive: disabled by default
+SKIP: tests/factor/t06.sh
+/usr/gnu/bin/mkdir -p tests/factor
+/bin/bash $(SOURCE_DIR)/tests/factor/create-test.sh tests/factor/t07.sh \
+  $(SOURCE_DIR)/tests/factor/run.sh > tests/factor/t07.sh-t
+chmod a+x tests/factor/t07.sh-t
+mv -f tests/factor/t07.sh-t tests/factor/t07.sh
+t07.sh: skipped test: very expensive: disabled by default
+SKIP: tests/factor/t07.sh
+/usr/gnu/bin/mkdir -p tests/factor
+/bin/bash $(SOURCE_DIR)/tests/factor/create-test.sh tests/factor/t08.sh \
+  $(SOURCE_DIR)/tests/factor/run.sh > tests/factor/t08.sh-t
+chmod a+x tests/factor/t08.sh-t
+mv -f tests/factor/t08.sh-t tests/factor/t08.sh
+t08.sh: skipped test: very expensive: disabled by default
+SKIP: tests/factor/t08.sh
+/usr/gnu/bin/mkdir -p tests/factor
+/bin/bash $(SOURCE_DIR)/tests/factor/create-test.sh tests/factor/t09.sh \
+  $(SOURCE_DIR)/tests/factor/run.sh > tests/factor/t09.sh-t
+chmod a+x tests/factor/t09.sh-t
+mv -f tests/factor/t09.sh-t tests/factor/t09.sh
+t09.sh: skipped test: very expensive: disabled by default
+SKIP: tests/factor/t09.sh
+/usr/gnu/bin/mkdir -p tests/factor
+/bin/bash $(SOURCE_DIR)/tests/factor/create-test.sh tests/factor/t10.sh \
+  $(SOURCE_DIR)/tests/factor/run.sh > tests/factor/t10.sh-t
+chmod a+x tests/factor/t10.sh-t
+mv -f tests/factor/t10.sh-t tests/factor/t10.sh
+t10.sh: skipped test: very expensive: disabled by default
+SKIP: tests/factor/t10.sh
+/usr/gnu/bin/mkdir -p tests/factor
+/bin/bash $(SOURCE_DIR)/tests/factor/create-test.sh tests/factor/t11.sh \
+  $(SOURCE_DIR)/tests/factor/run.sh > tests/factor/t11.sh-t
+chmod a+x tests/factor/t11.sh-t
+mv -f tests/factor/t11.sh-t tests/factor/t11.sh
+t11.sh: skipped test: very expensive: disabled by default
+SKIP: tests/factor/t11.sh
+/usr/gnu/bin/mkdir -p tests/factor
+/bin/bash $(SOURCE_DIR)/tests/factor/create-test.sh tests/factor/t12.sh \
+  $(SOURCE_DIR)/tests/factor/run.sh > tests/factor/t12.sh-t
+chmod a+x tests/factor/t12.sh-t
+mv -f tests/factor/t12.sh-t tests/factor/t12.sh
+t12.sh: skipped test: very expensive: disabled by default
+SKIP: tests/factor/t12.sh
+/usr/gnu/bin/mkdir -p tests/factor
+/bin/bash $(SOURCE_DIR)/tests/factor/create-test.sh tests/factor/t13.sh \
+  $(SOURCE_DIR)/tests/factor/run.sh > tests/factor/t13.sh-t
+chmod a+x tests/factor/t13.sh-t
+mv -f tests/factor/t13.sh-t tests/factor/t13.sh
+t13.sh: skipped test: very expensive: disabled by default
+SKIP: tests/factor/t13.sh
+/usr/gnu/bin/mkdir -p tests/factor
+/bin/bash $(SOURCE_DIR)/tests/factor/create-test.sh tests/factor/t14.sh \
+  $(SOURCE_DIR)/tests/factor/run.sh > tests/factor/t14.sh-t
+chmod a+x tests/factor/t14.sh-t
+mv -f tests/factor/t14.sh-t tests/factor/t14.sh
+t14.sh: skipped test: very expensive: disabled by default
+SKIP: tests/factor/t14.sh
+/usr/gnu/bin/mkdir -p tests/factor
+/bin/bash $(SOURCE_DIR)/tests/factor/create-test.sh tests/factor/t15.sh \
+  $(SOURCE_DIR)/tests/factor/run.sh > tests/factor/t15.sh-t
+chmod a+x tests/factor/t15.sh-t
+mv -f tests/factor/t15.sh-t tests/factor/t15.sh
+t15.sh: skipped test: very expensive: disabled by default
+SKIP: tests/factor/t15.sh
+/usr/gnu/bin/mkdir -p tests/factor
+/bin/bash $(SOURCE_DIR)/tests/factor/create-test.sh tests/factor/t16.sh \
+  $(SOURCE_DIR)/tests/factor/run.sh > tests/factor/t16.sh-t
+chmod a+x tests/factor/t16.sh-t
+mv -f tests/factor/t16.sh-t tests/factor/t16.sh
+t16.sh: skipped test: very expensive: disabled by default
+SKIP: tests/factor/t16.sh
+/usr/gnu/bin/mkdir -p tests/factor
+/bin/bash $(SOURCE_DIR)/tests/factor/create-test.sh tests/factor/t17.sh \
+  $(SOURCE_DIR)/tests/factor/run.sh > tests/factor/t17.sh-t
+chmod a+x tests/factor/t17.sh-t
+mv -f tests/factor/t17.sh-t tests/factor/t17.sh
+t17.sh: skipped test: very expensive: disabled by default
+SKIP: tests/factor/t17.sh
+/usr/gnu/bin/mkdir -p tests/factor
+/bin/bash $(SOURCE_DIR)/tests/factor/create-test.sh tests/factor/t18.sh \
+  $(SOURCE_DIR)/tests/factor/run.sh > tests/factor/t18.sh-t
+chmod a+x tests/factor/t18.sh-t
+mv -f tests/factor/t18.sh-t tests/factor/t18.sh
+t18.sh: skipped test: very expensive: disabled by default
+SKIP: tests/factor/t18.sh
+/usr/gnu/bin/mkdir -p tests/factor
+/bin/bash $(SOURCE_DIR)/tests/factor/create-test.sh tests/factor/t19.sh \
+  $(SOURCE_DIR)/tests/factor/run.sh > tests/factor/t19.sh-t
+chmod a+x tests/factor/t19.sh-t
+mv -f tests/factor/t19.sh-t tests/factor/t19.sh
+t19.sh: skipped test: very expensive: disabled by default
+SKIP: tests/factor/t19.sh
+/usr/gnu/bin/mkdir -p tests/factor
+/bin/bash $(SOURCE_DIR)/tests/factor/create-test.sh tests/factor/t20.sh \
+  $(SOURCE_DIR)/tests/factor/run.sh > tests/factor/t20.sh-t
+chmod a+x tests/factor/t20.sh-t
+mv -f tests/factor/t20.sh-t tests/factor/t20.sh
+t20.sh: skipped test: very expensive: disabled by default
+SKIP: tests/factor/t20.sh
+/usr/gnu/bin/mkdir -p tests/factor
+/bin/bash $(SOURCE_DIR)/tests/factor/create-test.sh tests/factor/t21.sh \
+  $(SOURCE_DIR)/tests/factor/run.sh > tests/factor/t21.sh-t
+chmod a+x tests/factor/t21.sh-t
+mv -f tests/factor/t21.sh-t tests/factor/t21.sh
+t21.sh: skipped test: very expensive: disabled by default
+SKIP: tests/factor/t21.sh
+/usr/gnu/bin/mkdir -p tests/factor
+/bin/bash $(SOURCE_DIR)/tests/factor/create-test.sh tests/factor/t22.sh \
+  $(SOURCE_DIR)/tests/factor/run.sh > tests/factor/t22.sh-t
+chmod a+x tests/factor/t22.sh-t
+mv -f tests/factor/t22.sh-t tests/factor/t22.sh
+t22.sh: skipped test: very expensive: disabled by default
+SKIP: tests/factor/t22.sh
+/usr/gnu/bin/mkdir -p tests/factor
+/bin/bash $(SOURCE_DIR)/tests/factor/create-test.sh tests/factor/t23.sh \
+  $(SOURCE_DIR)/tests/factor/run.sh > tests/factor/t23.sh-t
+chmod a+x tests/factor/t23.sh-t
+mv -f tests/factor/t23.sh-t tests/factor/t23.sh
+t23.sh: skipped test: very expensive: disabled by default
+SKIP: tests/factor/t23.sh
+/usr/gnu/bin/mkdir -p tests/factor
+/bin/bash $(SOURCE_DIR)/tests/factor/create-test.sh tests/factor/t24.sh \
+  $(SOURCE_DIR)/tests/factor/run.sh > tests/factor/t24.sh-t
+chmod a+x tests/factor/t24.sh-t
+mv -f tests/factor/t24.sh-t tests/factor/t24.sh
+t24.sh: skipped test: very expensive: disabled by default
+SKIP: tests/factor/t24.sh
+/usr/gnu/bin/mkdir -p tests/factor
+/bin/bash $(SOURCE_DIR)/tests/factor/create-test.sh tests/factor/t25.sh \
+  $(SOURCE_DIR)/tests/factor/run.sh > tests/factor/t25.sh-t
+chmod a+x tests/factor/t25.sh-t
+mv -f tests/factor/t25.sh-t tests/factor/t25.sh
+t25.sh: skipped test: very expensive: disabled by default
+SKIP: tests/factor/t25.sh
+/usr/gnu/bin/mkdir -p tests/factor
+/bin/bash $(SOURCE_DIR)/tests/factor/create-test.sh tests/factor/t26.sh \
+  $(SOURCE_DIR)/tests/factor/run.sh > tests/factor/t26.sh-t
+chmod a+x tests/factor/t26.sh-t
+mv -f tests/factor/t26.sh-t tests/factor/t26.sh
+t26.sh: skipped test: very expensive: disabled by default
+SKIP: tests/factor/t26.sh
+/usr/gnu/bin/mkdir -p tests/factor
+/bin/bash $(SOURCE_DIR)/tests/factor/create-test.sh tests/factor/t27.sh \
+  $(SOURCE_DIR)/tests/factor/run.sh > tests/factor/t27.sh-t
+chmod a+x tests/factor/t27.sh-t
+mv -f tests/factor/t27.sh-t tests/factor/t27.sh
+t27.sh: skipped test: very expensive: disabled by default
+SKIP: tests/factor/t27.sh
+/usr/gnu/bin/mkdir -p tests/factor
+/bin/bash $(SOURCE_DIR)/tests/factor/create-test.sh tests/factor/t28.sh \
+  $(SOURCE_DIR)/tests/factor/run.sh > tests/factor/t28.sh-t
+chmod a+x tests/factor/t28.sh-t
+mv -f tests/factor/t28.sh-t tests/factor/t28.sh
+t28.sh: skipped test: very expensive: disabled by default
+SKIP: tests/factor/t28.sh
+/usr/gnu/bin/mkdir -p tests/factor
+/bin/bash $(SOURCE_DIR)/tests/factor/create-test.sh tests/factor/t29.sh \
+  $(SOURCE_DIR)/tests/factor/run.sh > tests/factor/t29.sh-t
+chmod a+x tests/factor/t29.sh-t
+mv -f tests/factor/t29.sh-t tests/factor/t29.sh
+t29.sh: skipped test: very expensive: disabled by default
+SKIP: tests/factor/t29.sh
+/usr/gnu/bin/mkdir -p tests/factor
+/bin/bash $(SOURCE_DIR)/tests/factor/create-test.sh tests/factor/t30.sh \
+  $(SOURCE_DIR)/tests/factor/run.sh > tests/factor/t30.sh-t
+chmod a+x tests/factor/t30.sh-t
+mv -f tests/factor/t30.sh-t tests/factor/t30.sh
+t30.sh: skipped test: very expensive: disabled by default
+SKIP: tests/factor/t30.sh
+/usr/gnu/bin/mkdir -p tests/factor
+/bin/bash $(SOURCE_DIR)/tests/factor/create-test.sh tests/factor/t31.sh \
+  $(SOURCE_DIR)/tests/factor/run.sh > tests/factor/t31.sh-t
+chmod a+x tests/factor/t31.sh-t
+mv -f tests/factor/t31.sh-t tests/factor/t31.sh
+t31.sh: skipped test: very expensive: disabled by default
+SKIP: tests/factor/t31.sh
+/usr/gnu/bin/mkdir -p tests/factor
+/bin/bash $(SOURCE_DIR)/tests/factor/create-test.sh tests/factor/t32.sh \
+  $(SOURCE_DIR)/tests/factor/run.sh > tests/factor/t32.sh-t
+chmod a+x tests/factor/t32.sh-t
+mv -f tests/factor/t32.sh-t tests/factor/t32.sh
+t32.sh: skipped test: very expensive: disabled by default
+SKIP: tests/factor/t32.sh
+/usr/gnu/bin/mkdir -p tests/factor
+/bin/bash $(SOURCE_DIR)/tests/factor/create-test.sh tests/factor/t33.sh \
+  $(SOURCE_DIR)/tests/factor/run.sh > tests/factor/t33.sh-t
+chmod a+x tests/factor/t33.sh-t
+mv -f tests/factor/t33.sh-t tests/factor/t33.sh
+t33.sh: skipped test: very expensive: disabled by default
+SKIP: tests/factor/t33.sh
+/usr/gnu/bin/mkdir -p tests/factor
+/bin/bash $(SOURCE_DIR)/tests/factor/create-test.sh tests/factor/t34.sh \
+  $(SOURCE_DIR)/tests/factor/run.sh > tests/factor/t34.sh-t
+chmod a+x tests/factor/t34.sh-t
+mv -f tests/factor/t34.sh-t tests/factor/t34.sh
+t34.sh: skipped test: very expensive: disabled by default
+SKIP: tests/factor/t34.sh
+/usr/gnu/bin/mkdir -p tests/factor
+/bin/bash $(SOURCE_DIR)/tests/factor/create-test.sh tests/factor/t35.sh \
+  $(SOURCE_DIR)/tests/factor/run.sh > tests/factor/t35.sh-t
+chmod a+x tests/factor/t35.sh-t
+mv -f tests/factor/t35.sh-t tests/factor/t35.sh
+t35.sh: skipped test: very expensive: disabled by default
+SKIP: tests/factor/t35.sh
+/usr/gnu/bin/mkdir -p tests/factor
+/bin/bash $(SOURCE_DIR)/tests/factor/create-test.sh tests/factor/t36.sh \
+  $(SOURCE_DIR)/tests/factor/run.sh > tests/factor/t36.sh-t
+chmod a+x tests/factor/t36.sh-t
+mv -f tests/factor/t36.sh-t tests/factor/t36.sh
+t36.sh: skipped test: very expensive: disabled by default
+SKIP: tests/factor/t36.sh
+========================
+All 428 tests passed
+(135 tests were not run)
+========================
+make[5]: Leaving directory `$(@D)'
+rm -rf progs-readme progs-makefile
+echo src/chroot src/hostid src/nice src/who src/users src/pinky src/uptime src/stty src/df src/stdbuf src/[ src/base64 src/basename src/cat src/chcon src/chgrp src/chmod src/chown src/cksum src/comm src/cp src/csplit src/cut src/date src/dd src/dir src/dircolors src/dirname src/du src/echo src/env src/expand src/expr src/factor src/false src/fmt src/fold src/ginstall src/groups src/head src/id src/join src/kill src/link src/ln src/logname src/ls src/md5sum src/mkdir src/mkfifo src/mknod src/mktemp src/mv src/nl src/nproc src/nohup src/numfmt src/od src/paste src/pathchk src/pr src/printenv src/printf src/ptx src/pwd src/readlink src/realpath src/rm src/rmdir src/runcon src/seq src/sha1sum src/sha224sum src/sha256sum src/sha384sum src/sha512sum src/shred src/shuf src/sleep src/sort src/split src/stat src/sum src/sync src/tac src/tail src/tee src/test src/timeout src/touch src/tr src/true src/truncate src/tsort src/tty src/uname src/unexpand src/uniq src/unlink src/vdir src/wc src/whoami src/yes  src/arch src/coreutils src/hostname src/chroot src/df src/hostid src/libstdbuf.so src/nice src/pinky src/stdbuf src/stty src/uptime src/users src/who src/[ src/base64 src/basename src/cat src/chcon src/chgrp src/chmod src/chown src/cksum src/comm src/cp src/csplit src/cut src/date src/dd src/dir src/dircolors src/dirname src/du src/echo src/env src/expand src/expr src/factor src/false src/fmt src/fold src/ginstall src/groups src/head src/id src/join src/kill src/link src/ln src/logname src/ls src/md5sum src/mkdir src/mkfifo src/mknod src/mktemp src/mv src/nl src/nproc src/nohup src/numfmt src/od src/paste src/pathchk src/pr src/printenv src/printf src/ptx src/pwd src/readlink src/realpath src/rm src/rmdir src/runcon src/seq src/sha1sum src/sha224sum src/sha256sum src/sha384sum src/sha512sum src/shred src/shuf src/sleep src/sort src/split src/stat src/sum src/sync src/tac src/tail src/tee src/test src/timeout src/touch src/tr src/true src/truncate src/tsort src/tty src/uname src/unexpand src/uniq src/unlink src/vdir src/wc src/whoami src/yes \
+ | tr -s ' ' '\n' \
+ | sed -e 's,$,,' \
+       -e 's,^src/,,' \
+       -e 's/^ginstall$/install/' \
+ | sed /libstdbuf/d \
+ | LC_ALL=C sort -u > progs-makefile && \
+sed -n '/^The programs .* are:/,/^[a-zA-Z]/p' $(SOURCE_DIR)/README \
+  | sed -n '/^   */s///p' | tr -s ' ' '\n' > progs-readme
+diff progs-makefile progs-readme && rm -rf progs-readme progs-makefile
+test -z "`echo 'src/arch src/coreutils src/hostname src/chroot src/df src/hostid src/libstdbuf.so src/nice src/pinky src/stdbuf src/stty src/uptime src/users src/who src/[ src/base64 src/basename src/cat src/chcon src/chgrp src/chmod src/chown src/cksum src/comm src/cp src/csplit src/cut src/date src/dd src/dir src/dircolors src/dirname src/du src/echo src/env src/expand src/expr src/factor src/false src/fmt src/fold src/ginstall src/groups src/head src/id src/join src/kill src/link src/ln src/logname src/ls src/md5sum src/mkdir src/mkfifo src/mknod src/mktemp src/mv src/nl src/nproc src/nohup src/numfmt src/od src/paste src/pathchk src/pr src/printenv src/printf src/ptx src/pwd src/readlink src/realpath src/rm src/rmdir src/runcon src/seq src/sha1sum src/sha224sum src/sha256sum src/sha384sum src/sha512sum src/shred src/shuf src/sleep src/sort src/split src/stat src/sum src/sync src/tac src/tail src/tee src/test src/timeout src/touch src/tr src/true src/truncate src/tsort src/tty src/uname src/unexpand src/uniq src/unlink src/vdir src/wc src/whoami src/yes' | tr ' ' '\n' | uniq -d`"
+/usr/gnu/bin/grep -E -i '(^|[^A-Za-z0-9_])builtins?([^A-Za-z0-9_]|$)' $(SOURCE_DIR)/doc/*.texi	\
+  && exit 1 || :
+/usr/gnu/bin/grep -E '(^|[^A-Za-z0-9_])IO([^A-Za-z0-9_]|$)' $(SOURCE_DIR)/doc/*.texi && exit 1 || :
+/usr/gnu/bin/grep -E non-zero $(SOURCE_DIR)/doc/*.texi && exit 1 || :
+fail=0;						\
+/usr/gnu/bin/grep -E -i '(^|[^A-Za-z0-9_])path(name)?s?([^A-Za-z0-9_]|$)' $(SOURCE_DIR)/doc/*.texi		\
+  | /usr/gnu/bin/grep -E -v							\
+  'PATH=|path search|search path|@vindex PATH$|@env[{]PATH[}]'	\
+  && fail=1;							\
+exit $fail
+/usr/gnu/bin/grep -E timezone $(SOURCE_DIR)/doc/*.texi && exit 1 || :
+/usr/gnu/bin/grep -E -i '(^|[^A-Za-z0-9_])zeroes([^A-Za-z0-9_]|$)' $(SOURCE_DIR)/doc/*.texi	\
+  && exit 1 || :
+/usr/gnu/bin/grep -E '\{.*\^[0-9][0-9]' $(SOURCE_DIR)/doc/*.texi && exit 1 || :
+perl -e 1 || { echo sc-lower-case-var: skipping test; exit 0; }; \
+  perl -lne '/\@var{/ or next; while (/\@var{(.+?)}/g) { $v = $1; $v =~ /[A-Z]/ && $v !~ /^\\/ and (print "$ARGV:$.:$_"), $m = 1 } END {$m and (warn "sc-lower-case-var: do not use upper case in \@var{...}\n"), exit 1}' $(SOURCE_DIR)/doc/*.texi
+fail=0;						\
+grep '@url{' $(SOURCE_DIR)/doc/*.texi && fail=1;				\
+grep '\[email protected]"' $(SOURCE_DIR)/doc/*.texi && fail=1;				\
+grep -n '[^[:punct:]]@footnote' $(SOURCE_DIR)/doc/*.texi && fail=1;	\
+grep -n filename $(SOURCE_DIR)/doc/*.texi					\
+    | /usr/gnu/bin/grep -E -v 'setfilename|[{]filename[}]'			\
+  && fail=1;							\
+exit $fail
+make[4]: Leaving directory `$(@D)'
+make[3]: Leaving directory `$(@D)'
+Making check in gnulib-tests
+make[3]: Entering directory `$(@D)/gnulib-tests'
+/usr/gnu/bin/make  check-recursive
+make[4]: Entering directory `$(@D)/gnulib-tests'
+Making check in .
+make[5]: Entering directory `$(@D)/gnulib-tests'
+/usr/gnu/bin/make  libtests.a test-accept test-file-has-acl test-set-mode-acl test-copy-acl test-sameacls test-alignof test-alloca-opt test-areadlink test-areadlink-with-size test-areadlinkat test-argmatch test-argv-iter test-arpa_inet test-base64 test-binary-io test-bind test-bitrotate test-btowc test-c-ctype test-c-strcasecmp test-c-strncasecmp test-calloc-gnu test-canonicalize test-chdir test-chown test-cloexec test-close test-closein test-connect test-md5 test-sha1 test-ctype test-di-set test-dirent-safer test-dirent test-dirname test-dup test-dup2 test-environ test-errno test-exclude test-faccessat test-fadvise test-fchdir test-fchmodat test-fchownat test-fclose test-fcntl-h test-fcntl-safer test-fcntl test-fdatasync test-fdopen test-fdopendir test-fdutimensat test-fflush test-fflush2 test-fgetc test-filenamecat test-filevercmp test-float test-fnmatch test-fopen-safer test-fopen test-fpending test-fpurge test-fputc test-fread test-freadahead test-freading test-freadptr test-freadptr2 test-freadseek test-freopen-safer test-freopen test-frexp-nolibm test-frexpl-nolibm test-fseek test-fseeko test-fseeko3 test-fseeko4 test-fseterr test-fstat test-fstatat test-fsync test-ftell test-ftell3 test-ftello test-ftello3 test-ftello4 test-ftruncate test-futimens test-fwrite test-getaddrinfo test-getcwd-lgpl test-getcwd test-getdelim test-getdtablesize test-getgroups test-gethostname test-getline test-getloadavg test-getlogin test-getndelim2 test-getopt test-gettimeofday test-hash test-i-ring test-iconv-h test-iconv test-ignore-value test-inet_ntop test-inet_pton test-ino-map test-intprops test-inttostr test-inttypes test-ioctl test-isatty test-isblank test-isnand-nolibm test-isnanf-nolibm test-isnanl-nolibm test-iswblank test-langinfo test-lchown test-link test-linkat test-listen test-locale test-localeconv test-localename test-lock test-lseek test-lstat test-malloc-gnu test-malloca test-math test-mbrtowc test-mbrtowc-w32 test-mbsalign test-mbscasecmp test-mbsinit test-mbsrtowcs test-mbsstr1 test-mbsstr2 test-mbsstr3 test-memcasecmp test-memchr test-memchr2 test-memcoll test-memrchr test-mkdir test-mkfifo test-mknod test-nanosleep test-netdb test-netinet_in test-nl_langinfo test-open test-openat-safer test-openat test-parse-datetime test-pathmax test-perror test-perror2 test-pipe test-posixtm test-printf-frexp test-printf-frexpl test-priv-set test-quotearg-simple test-raise test-rand-isaac test-read-file test-read test-readlink test-readlinkat test-readtokens test-realloc-gnu test-regex test-remove test-rename test-rmdir test-sched test-select test-select-fd test-select-stdin test-setenv test-setlocale1 test-setlocale2 test-setsockopt test-sigaction test-signal-h test-signbit test-sigprocmask test-sleep test-snprintf test-sockets test-stat test-stat-time test-statat test-stdalign test-stdbool test-stddef test-stdint test-stdio test-stdlib test-strerror test-strerror_r test-strftime test-striconv test-string test-strncat test-strnlen test-strsignal test-strtod test-strtoimax test-strtoll test-strtoull test-strtoumax test-symlink test-symlinkat test-sys_ioctl test-sys_resource test-sys_select test-sys_socket test-sys_stat test-sys_time test-sys_types test-sys_uio test-sys_utsname test-sys_wait test-termios test-thread_self test-thread_create test-time test-tls test-u64 test-uname test-dup-safer test-unistd test-u8-mbtoucr test-u8-uctomb test-uc_width test-uc_width2 test-unlink test-unlinkat test-unsetenv test-userspec test-utimens test-utimensat test-vasnprintf test-vasprintf-posix test-vasprintf test-verify test-version-etc test-vfprintf-posix test-vprintf-posix test-wchar test-wcrtomb test-wcrtomb-w32 test-wctype-h test-wcwidth test-write test-xalloc-die test-xfprintf-posix test-xprintf-posix test-xstrtoimax test-xstrtol test-xstrtoul test-xstrtoumax test-xvasprintf test-yesno
+make[6]: Entering directory `$(@D)/gnulib-tests'
+source='$(SOURCE_DIR)/gnulib-tests/binary-io.c' object='binary-io.o' libtool=no \
+DEPDIR=.deps depmode=none /bin/bash $(SOURCE_DIR)/build-aux/depcomp \
+$(CC)
+source='$(SOURCE_DIR)/gnulib-tests/localename.c' object='localename.o' libtool=no \
+DEPDIR=.deps depmode=none /bin/bash $(SOURCE_DIR)/build-aux/depcomp \
+$(CC)
+source='$(SOURCE_DIR)/gnulib-tests/glthread/thread.c' object='glthread/thread.o' libtool=no \
+DEPDIR=.deps depmode=none /bin/bash $(SOURCE_DIR)/build-aux/depcomp \
+$(CC)
+source='$(SOURCE_DIR)/gnulib-tests/unlinkdir.c' object='unlinkdir.o' libtool=no \
+DEPDIR=.deps depmode=none /bin/bash $(SOURCE_DIR)/build-aux/depcomp \
+$(CC)
+source='$(SOURCE_DIR)/gnulib-tests/perror.c' object='perror.o' libtool=no \
+DEPDIR=.deps depmode=none /bin/bash $(SOURCE_DIR)/build-aux/depcomp \
+$(CC)
+source='$(SOURCE_DIR)/gnulib-tests/strerror_r.c' object='strerror_r.o' libtool=no \
+DEPDIR=.deps depmode=none /bin/bash $(SOURCE_DIR)/build-aux/depcomp \
+$(CC)
+rm -f libtests.a
+ar cru libtests.a binary-io.o localename.o glthread/thread.o unlinkdir.o perror.o strerror_r.o
+ranlib libtests.a
+source='$(SOURCE_DIR)/gnulib-tests/test-accept.c' object='test-accept.o' libtool=no \
+DEPDIR=.deps depmode=none /bin/bash $(SOURCE_DIR)/build-aux/depcomp \
+$(CC)
+$(CC)
+source='$(SOURCE_DIR)/gnulib-tests/test-file-has-acl.c' object='test-file-has-acl.o' libtool=no \
+DEPDIR=.deps depmode=none /bin/bash $(SOURCE_DIR)/build-aux/depcomp \
+$(CC)
+$(CC)
+source='$(SOURCE_DIR)/gnulib-tests/test-set-mode-acl.c' object='test-set-mode-acl.o' libtool=no \
+DEPDIR=.deps depmode=none /bin/bash $(SOURCE_DIR)/build-aux/depcomp \
+$(CC)
+$(CC)
+source='$(SOURCE_DIR)/gnulib-tests/test-copy-acl.c' object='test-copy-acl.o' libtool=no \
+DEPDIR=.deps depmode=none /bin/bash $(SOURCE_DIR)/build-aux/depcomp \
+$(CC)
+$(CC)
+source='$(SOURCE_DIR)/gnulib-tests/test-sameacls.c' object='test-sameacls.o' libtool=no \
+DEPDIR=.deps depmode=none /bin/bash $(SOURCE_DIR)/build-aux/depcomp \
+$(CC)
+$(CC)
+source='$(SOURCE_DIR)/gnulib-tests/test-alignof.c' object='test-alignof.o' libtool=no \
+DEPDIR=.deps depmode=none /bin/bash $(SOURCE_DIR)/build-aux/depcomp \
+$(CC)
+$(CC)
+source='$(SOURCE_DIR)/gnulib-tests/test-alloca-opt.c' object='test-alloca-opt.o' libtool=no \
+DEPDIR=.deps depmode=none /bin/bash $(SOURCE_DIR)/build-aux/depcomp \
+$(CC)
+$(CC)
+source='$(SOURCE_DIR)/gnulib-tests/test-areadlink.c' object='test-areadlink.o' libtool=no \
+DEPDIR=.deps depmode=none /bin/bash $(SOURCE_DIR)/build-aux/depcomp \
+$(CC)
+$(CC)
+source='$(SOURCE_DIR)/gnulib-tests/test-areadlink-with-size.c' object='test-areadlink-with-size.o' libtool=no \
+DEPDIR=.deps depmode=none /bin/bash $(SOURCE_DIR)/build-aux/depcomp \
+$(CC)
+$(CC)
+source='$(SOURCE_DIR)/gnulib-tests/test-areadlinkat.c' object='test-areadlinkat.o' libtool=no \
+DEPDIR=.deps depmode=none /bin/bash $(SOURCE_DIR)/build-aux/depcomp \
+$(CC)
+$(CC)
+source='$(SOURCE_DIR)/gnulib-tests/test-argmatch.c' object='test-argmatch.o' libtool=no \
+DEPDIR=.deps depmode=none /bin/bash $(SOURCE_DIR)/build-aux/depcomp \
+$(CC)
+$(CC)
+source='$(SOURCE_DIR)/gnulib-tests/test-argv-iter.c' object='test-argv-iter.o' libtool=no \
+DEPDIR=.deps depmode=none /bin/bash $(SOURCE_DIR)/build-aux/depcomp \
+$(CC)
+$(CC)
+source='$(SOURCE_DIR)/gnulib-tests/test-arpa_inet.c' object='test-arpa_inet.o' libtool=no \
+DEPDIR=.deps depmode=none /bin/bash $(SOURCE_DIR)/build-aux/depcomp \
+$(CC)
+$(CC)
+source='$(SOURCE_DIR)/gnulib-tests/test-base64.c' object='test-base64.o' libtool=no \
+DEPDIR=.deps depmode=none /bin/bash $(SOURCE_DIR)/build-aux/depcomp \
+$(CC)
+$(CC)
+source='$(SOURCE_DIR)/gnulib-tests/test-binary-io.c' object='test-binary-io.o' libtool=no \
+DEPDIR=.deps depmode=none /bin/bash $(SOURCE_DIR)/build-aux/depcomp \
+$(CC)
+$(CC)
+source='$(SOURCE_DIR)/gnulib-tests/test-bind.c' object='test-bind.o' libtool=no \
+DEPDIR=.deps depmode=none /bin/bash $(SOURCE_DIR)/build-aux/depcomp \
+$(CC)
+$(CC)
+source='$(SOURCE_DIR)/gnulib-tests/test-bitrotate.c' object='test-bitrotate.o' libtool=no \
+DEPDIR=.deps depmode=none /bin/bash $(SOURCE_DIR)/build-aux/depcomp \
+$(CC)
+$(CC)
+source='$(SOURCE_DIR)/gnulib-tests/test-btowc.c' object='test-btowc.o' libtool=no \
+DEPDIR=.deps depmode=none /bin/bash $(SOURCE_DIR)/build-aux/depcomp \
+$(CC)
+$(CC)
+source='$(SOURCE_DIR)/gnulib-tests/test-c-ctype.c' object='test-c-ctype.o' libtool=no \
+DEPDIR=.deps depmode=none /bin/bash $(SOURCE_DIR)/build-aux/depcomp \
+$(CC)
+$(CC)
+source='$(SOURCE_DIR)/gnulib-tests/test-c-strcasecmp.c' object='test-c-strcasecmp.o' libtool=no \
+DEPDIR=.deps depmode=none /bin/bash $(SOURCE_DIR)/build-aux/depcomp \
+$(CC)
+$(CC)
+source='$(SOURCE_DIR)/gnulib-tests/test-c-strncasecmp.c' object='test-c-strncasecmp.o' libtool=no \
+DEPDIR=.deps depmode=none /bin/bash $(SOURCE_DIR)/build-aux/depcomp \
+$(CC)
+$(CC)
+source='$(SOURCE_DIR)/gnulib-tests/test-calloc-gnu.c' object='test-calloc-gnu.o' libtool=no \
+DEPDIR=.deps depmode=none /bin/bash $(SOURCE_DIR)/build-aux/depcomp \
+$(CC)
+$(CC)
+source='$(SOURCE_DIR)/gnulib-tests/test-canonicalize.c' object='test-canonicalize.o' libtool=no \
+DEPDIR=.deps depmode=none /bin/bash $(SOURCE_DIR)/build-aux/depcomp \
+$(CC)
+$(CC)
+source='$(SOURCE_DIR)/gnulib-tests/test-chdir.c' object='test-chdir.o' libtool=no \
+DEPDIR=.deps depmode=none /bin/bash $(SOURCE_DIR)/build-aux/depcomp \
+$(CC)
+$(CC)
+source='$(SOURCE_DIR)/gnulib-tests/test-chown.c' object='test-chown.o' libtool=no \
+DEPDIR=.deps depmode=none /bin/bash $(SOURCE_DIR)/build-aux/depcomp \
+$(CC)
+$(CC)
+source='$(SOURCE_DIR)/gnulib-tests/test-cloexec.c' object='test-cloexec.o' libtool=no \
+DEPDIR=.deps depmode=none /bin/bash $(SOURCE_DIR)/build-aux/depcomp \
+$(CC)
+$(CC)
+source='$(SOURCE_DIR)/gnulib-tests/test-close.c' object='test-close.o' libtool=no \
+DEPDIR=.deps depmode=none /bin/bash $(SOURCE_DIR)/build-aux/depcomp \
+$(CC)
+$(CC)
+source='$(SOURCE_DIR)/gnulib-tests/test-closein.c' object='test-closein.o' libtool=no \
+DEPDIR=.deps depmode=none /bin/bash $(SOURCE_DIR)/build-aux/depcomp \
+$(CC)
+$(CC)
+source='$(SOURCE_DIR)/gnulib-tests/test-connect.c' object='test-connect.o' libtool=no \
+DEPDIR=.deps depmode=none /bin/bash $(SOURCE_DIR)/build-aux/depcomp \
+$(CC)
+$(CC)
+source='$(SOURCE_DIR)/gnulib-tests/test-md5.c' object='test-md5.o' libtool=no \
+DEPDIR=.deps depmode=none /bin/bash $(SOURCE_DIR)/build-aux/depcomp \
+$(CC)
+$(CC)
+source='$(SOURCE_DIR)/gnulib-tests/test-sha1.c' object='test-sha1.o' libtool=no \
+DEPDIR=.deps depmode=none /bin/bash $(SOURCE_DIR)/build-aux/depcomp \
+$(CC)
+$(CC)
+source='$(SOURCE_DIR)/gnulib-tests/test-ctype.c' object='test-ctype.o' libtool=no \
+DEPDIR=.deps depmode=none /bin/bash $(SOURCE_DIR)/build-aux/depcomp \
+$(CC)
+$(CC)
+source='$(SOURCE_DIR)/gnulib-tests/test-di-set.c' object='test-di-set.o' libtool=no \
+DEPDIR=.deps depmode=none /bin/bash $(SOURCE_DIR)/build-aux/depcomp \
+$(CC)
+$(CC)
+source='$(SOURCE_DIR)/gnulib-tests/test-dirent-safer.c' object='test-dirent-safer.o' libtool=no \
+DEPDIR=.deps depmode=none /bin/bash $(SOURCE_DIR)/build-aux/depcomp \
+$(CC)
+$(CC)
+source='$(SOURCE_DIR)/gnulib-tests/test-dirent.c' object='test-dirent.o' libtool=no \
+DEPDIR=.deps depmode=none /bin/bash $(SOURCE_DIR)/build-aux/depcomp \
+$(CC)
+$(CC)
+source='$(SOURCE_DIR)/gnulib-tests/test-dirname.c' object='test-dirname.o' libtool=no \
+DEPDIR=.deps depmode=none /bin/bash $(SOURCE_DIR)/build-aux/depcomp \
+$(CC)
+$(CC)
+source='$(SOURCE_DIR)/gnulib-tests/test-dup.c' object='test-dup.o' libtool=no \
+DEPDIR=.deps depmode=none /bin/bash $(SOURCE_DIR)/build-aux/depcomp \
+$(CC)
+$(CC)
+source='$(SOURCE_DIR)/gnulib-tests/test-dup2.c' object='test-dup2.o' libtool=no \
+DEPDIR=.deps depmode=none /bin/bash $(SOURCE_DIR)/build-aux/depcomp \
+$(CC)
+$(CC)
+source='$(SOURCE_DIR)/gnulib-tests/test-environ.c' object='test-environ.o' libtool=no \
+DEPDIR=.deps depmode=none /bin/bash $(SOURCE_DIR)/build-aux/depcomp \
+$(CC)
+$(CC)
+source='$(SOURCE_DIR)/gnulib-tests/test-errno.c' object='test-errno.o' libtool=no \
+DEPDIR=.deps depmode=none /bin/bash $(SOURCE_DIR)/build-aux/depcomp \
+$(CC)
+$(CC)
+source='$(SOURCE_DIR)/gnulib-tests/test-exclude.c' object='test-exclude.o' libtool=no \
+DEPDIR=.deps depmode=none /bin/bash $(SOURCE_DIR)/build-aux/depcomp \
+$(CC)
+$(CC)
+source='$(SOURCE_DIR)/gnulib-tests/test-faccessat.c' object='test-faccessat.o' libtool=no \
+DEPDIR=.deps depmode=none /bin/bash $(SOURCE_DIR)/build-aux/depcomp \
+$(CC)
+$(CC)
+source='$(SOURCE_DIR)/gnulib-tests/test-fadvise.c' object='test-fadvise.o' libtool=no \
+DEPDIR=.deps depmode=none /bin/bash $(SOURCE_DIR)/build-aux/depcomp \
+$(CC)
+$(CC)
+source='$(SOURCE_DIR)/gnulib-tests/test-fchdir.c' object='test-fchdir.o' libtool=no \
+DEPDIR=.deps depmode=none /bin/bash $(SOURCE_DIR)/build-aux/depcomp \
+$(CC)
+$(CC)
+source='$(SOURCE_DIR)/gnulib-tests/test-fchmodat.c' object='test-fchmodat.o' libtool=no \
+DEPDIR=.deps depmode=none /bin/bash $(SOURCE_DIR)/build-aux/depcomp \
+$(CC)
+$(CC)
+source='$(SOURCE_DIR)/gnulib-tests/test-fchownat.c' object='test-fchownat.o' libtool=no \
+DEPDIR=.deps depmode=none /bin/bash $(SOURCE_DIR)/build-aux/depcomp \
+$(CC)
+$(CC)
+source='$(SOURCE_DIR)/gnulib-tests/test-fclose.c' object='test-fclose.o' libtool=no \
+DEPDIR=.deps depmode=none /bin/bash $(SOURCE_DIR)/build-aux/depcomp \
+$(CC)
+$(CC)
+source='$(SOURCE_DIR)/gnulib-tests/test-fcntl-h.c' object='test-fcntl-h.o' libtool=no \
+DEPDIR=.deps depmode=none /bin/bash $(SOURCE_DIR)/build-aux/depcomp \
+$(CC)
+$(CC)
+source='$(SOURCE_DIR)/gnulib-tests/test-fcntl-safer.c' object='test-fcntl-safer.o' libtool=no \
+DEPDIR=.deps depmode=none /bin/bash $(SOURCE_DIR)/build-aux/depcomp \
+$(CC)
+$(CC)
+source='$(SOURCE_DIR)/gnulib-tests/test-fcntl.c' object='test-fcntl.o' libtool=no \
+DEPDIR=.deps depmode=none /bin/bash $(SOURCE_DIR)/build-aux/depcomp \
+$(CC)
+$(CC)
+source='$(SOURCE_DIR)/gnulib-tests/test-fdatasync.c' object='test-fdatasync.o' libtool=no \
+DEPDIR=.deps depmode=none /bin/bash $(SOURCE_DIR)/build-aux/depcomp \
+$(CC)
+$(CC)
+source='$(SOURCE_DIR)/gnulib-tests/test-fdopen.c' object='test-fdopen.o' libtool=no \
+DEPDIR=.deps depmode=none /bin/bash $(SOURCE_DIR)/build-aux/depcomp \
+$(CC)
+$(CC)
+source='$(SOURCE_DIR)/gnulib-tests/test-fdopendir.c' object='test-fdopendir.o' libtool=no \
+DEPDIR=.deps depmode=none /bin/bash $(SOURCE_DIR)/build-aux/depcomp \
+$(CC)
+$(CC)
+source='$(SOURCE_DIR)/gnulib-tests/test-fdutimensat.c' object='test-fdutimensat.o' libtool=no \
+DEPDIR=.deps depmode=none /bin/bash $(SOURCE_DIR)/build-aux/depcomp \
+$(CC)
+$(CC)
+source='$(SOURCE_DIR)/gnulib-tests/test-fflush.c' object='test-fflush.o' libtool=no \
+DEPDIR=.deps depmode=none /bin/bash $(SOURCE_DIR)/build-aux/depcomp \
+$(CC)
+$(CC)
+source='$(SOURCE_DIR)/gnulib-tests/test-fflush2.c' object='test-fflush2.o' libtool=no \
+DEPDIR=.deps depmode=none /bin/bash $(SOURCE_DIR)/build-aux/depcomp \
+$(CC)
+$(CC)
+source='$(SOURCE_DIR)/gnulib-tests/test-fgetc.c' object='test-fgetc.o' libtool=no \
+DEPDIR=.deps depmode=none /bin/bash $(SOURCE_DIR)/build-aux/depcomp \
+$(CC)
+$(CC)
+source='$(SOURCE_DIR)/gnulib-tests/test-filenamecat.c' object='test-filenamecat.o' libtool=no \
+DEPDIR=.deps depmode=none /bin/bash $(SOURCE_DIR)/build-aux/depcomp \
+$(CC)
+$(CC)
+source='$(SOURCE_DIR)/gnulib-tests/test-filevercmp.c' object='test-filevercmp.o' libtool=no \
+DEPDIR=.deps depmode=none /bin/bash $(SOURCE_DIR)/build-aux/depcomp \
+$(CC)
+$(CC)
+source='$(SOURCE_DIR)/gnulib-tests/test-float.c' object='test-float.o' libtool=no \
+DEPDIR=.deps depmode=none /bin/bash $(SOURCE_DIR)/build-aux/depcomp \
+$(CC)
+$(CC)
+source='$(SOURCE_DIR)/gnulib-tests/test-fnmatch.c' object='test-fnmatch.o' libtool=no \
+DEPDIR=.deps depmode=none /bin/bash $(SOURCE_DIR)/build-aux/depcomp \
+$(CC)
+$(CC)
+source='$(SOURCE_DIR)/gnulib-tests/test-fopen-safer.c' object='test-fopen-safer.o' libtool=no \
+DEPDIR=.deps depmode=none /bin/bash $(SOURCE_DIR)/build-aux/depcomp \
+$(CC)
+$(CC)
+source='$(SOURCE_DIR)/gnulib-tests/test-fopen.c' object='test-fopen.o' libtool=no \
+DEPDIR=.deps depmode=none /bin/bash $(SOURCE_DIR)/build-aux/depcomp \
+$(CC)
+$(CC)
+source='$(SOURCE_DIR)/gnulib-tests/test-fpending.c' object='test-fpending.o' libtool=no \
+DEPDIR=.deps depmode=none /bin/bash $(SOURCE_DIR)/build-aux/depcomp \
+$(CC)
+$(CC)
+source='$(SOURCE_DIR)/gnulib-tests/test-fpurge.c' object='test-fpurge.o' libtool=no \
+DEPDIR=.deps depmode=none /bin/bash $(SOURCE_DIR)/build-aux/depcomp \
+$(CC)
+$(CC)
+source='$(SOURCE_DIR)/gnulib-tests/test-fputc.c' object='test-fputc.o' libtool=no \
+DEPDIR=.deps depmode=none /bin/bash $(SOURCE_DIR)/build-aux/depcomp \
+$(CC)
+$(CC)
+source='$(SOURCE_DIR)/gnulib-tests/test-fread.c' object='test-fread.o' libtool=no \
+DEPDIR=.deps depmode=none /bin/bash $(SOURCE_DIR)/build-aux/depcomp \
+$(CC)
+$(CC)
+source='$(SOURCE_DIR)/gnulib-tests/test-freadahead.c' object='test-freadahead.o' libtool=no \
+DEPDIR=.deps depmode=none /bin/bash $(SOURCE_DIR)/build-aux/depcomp \
+$(CC)
+$(CC)
+source='$(SOURCE_DIR)/gnulib-tests/test-freading.c' object='test-freading.o' libtool=no \
+DEPDIR=.deps depmode=none /bin/bash $(SOURCE_DIR)/build-aux/depcomp \
+$(CC)
+$(CC)
+source='$(SOURCE_DIR)/gnulib-tests/test-freadptr.c' object='test-freadptr.o' libtool=no \
+DEPDIR=.deps depmode=none /bin/bash $(SOURCE_DIR)/build-aux/depcomp \
+$(CC)
+$(CC)
+source='$(SOURCE_DIR)/gnulib-tests/test-freadptr2.c' object='test-freadptr2.o' libtool=no \
+DEPDIR=.deps depmode=none /bin/bash $(SOURCE_DIR)/build-aux/depcomp \
+$(CC)
+$(CC)
+source='$(SOURCE_DIR)/gnulib-tests/test-freadseek.c' object='test-freadseek.o' libtool=no \
+DEPDIR=.deps depmode=none /bin/bash $(SOURCE_DIR)/build-aux/depcomp \
+$(CC)
+$(CC)
+source='$(SOURCE_DIR)/gnulib-tests/test-freopen-safer.c' object='test-freopen-safer.o' libtool=no \
+DEPDIR=.deps depmode=none /bin/bash $(SOURCE_DIR)/build-aux/depcomp \
+$(CC)
+$(CC)
+source='$(SOURCE_DIR)/gnulib-tests/test-freopen.c' object='test-freopen.o' libtool=no \
+DEPDIR=.deps depmode=none /bin/bash $(SOURCE_DIR)/build-aux/depcomp \
+$(CC)
+$(CC)
+source='$(SOURCE_DIR)/gnulib-tests/test-frexp.c' object='test-frexp.o' libtool=no \
+DEPDIR=.deps depmode=none /bin/bash $(SOURCE_DIR)/build-aux/depcomp \
+$(CC)
+source='$(SOURCE_DIR)/gnulib-tests/randomd.c' object='randomd.o' libtool=no \
+DEPDIR=.deps depmode=none /bin/bash $(SOURCE_DIR)/build-aux/depcomp \
+$(CC)
+$(CC)
+source='$(SOURCE_DIR)/gnulib-tests/test-frexpl.c' object='test-frexpl.o' libtool=no \
+DEPDIR=.deps depmode=none /bin/bash $(SOURCE_DIR)/build-aux/depcomp \
+$(CC)
+source='$(SOURCE_DIR)/gnulib-tests/randoml.c' object='randoml.o' libtool=no \
+DEPDIR=.deps depmode=none /bin/bash $(SOURCE_DIR)/build-aux/depcomp \
+$(CC)
+$(CC)
+source='$(SOURCE_DIR)/gnulib-tests/test-fseek.c' object='test-fseek.o' libtool=no \
+DEPDIR=.deps depmode=none /bin/bash $(SOURCE_DIR)/build-aux/depcomp \
+$(CC)
+$(CC)
+source='$(SOURCE_DIR)/gnulib-tests/test-fseeko.c' object='test-fseeko.o' libtool=no \
+DEPDIR=.deps depmode=none /bin/bash $(SOURCE_DIR)/build-aux/depcomp \
+$(CC)
+$(CC)
+source='$(SOURCE_DIR)/gnulib-tests/test-fseeko3.c' object='test-fseeko3.o' libtool=no \
+DEPDIR=.deps depmode=none /bin/bash $(SOURCE_DIR)/build-aux/depcomp \
+$(CC)
+$(CC)
+source='$(SOURCE_DIR)/gnulib-tests/test-fseeko4.c' object='test-fseeko4.o' libtool=no \
+DEPDIR=.deps depmode=none /bin/bash $(SOURCE_DIR)/build-aux/depcomp \
+$(CC)
+$(CC)
+source='$(SOURCE_DIR)/gnulib-tests/test-fseterr.c' object='test-fseterr.o' libtool=no \
+DEPDIR=.deps depmode=none /bin/bash $(SOURCE_DIR)/build-aux/depcomp \
+$(CC)
+$(CC)
+source='$(SOURCE_DIR)/gnulib-tests/test-fstat.c' object='test-fstat.o' libtool=no \
+DEPDIR=.deps depmode=none /bin/bash $(SOURCE_DIR)/build-aux/depcomp \
+$(CC)
+$(CC)
+source='$(SOURCE_DIR)/gnulib-tests/test-fstatat.c' object='test-fstatat.o' libtool=no \
+DEPDIR=.deps depmode=none /bin/bash $(SOURCE_DIR)/build-aux/depcomp \
+$(CC)
+$(CC)
+source='$(SOURCE_DIR)/gnulib-tests/test-fsync.c' object='test-fsync.o' libtool=no \
+DEPDIR=.deps depmode=none /bin/bash $(SOURCE_DIR)/build-aux/depcomp \
+$(CC)
+$(CC)
+source='$(SOURCE_DIR)/gnulib-tests/test-ftell.c' object='test-ftell.o' libtool=no \
+DEPDIR=.deps depmode=none /bin/bash $(SOURCE_DIR)/build-aux/depcomp \
+$(CC)
+$(CC)
+source='$(SOURCE_DIR)/gnulib-tests/test-ftell3.c' object='test-ftell3.o' libtool=no \
+DEPDIR=.deps depmode=none /bin/bash $(SOURCE_DIR)/build-aux/depcomp \
+$(CC)
+$(CC)
+source='$(SOURCE_DIR)/gnulib-tests/test-ftello.c' object='test-ftello.o' libtool=no \
+DEPDIR=.deps depmode=none /bin/bash $(SOURCE_DIR)/build-aux/depcomp \
+$(CC)
+$(CC)
+source='$(SOURCE_DIR)/gnulib-tests/test-ftello3.c' object='test-ftello3.o' libtool=no \
+DEPDIR=.deps depmode=none /bin/bash $(SOURCE_DIR)/build-aux/depcomp \
+$(CC)
+$(CC)
+source='$(SOURCE_DIR)/gnulib-tests/test-ftello4.c' object='test-ftello4.o' libtool=no \
+DEPDIR=.deps depmode=none /bin/bash $(SOURCE_DIR)/build-aux/depcomp \
+$(CC)
+$(CC)
+source='$(SOURCE_DIR)/gnulib-tests/test-ftruncate.c' object='test-ftruncate.o' libtool=no \
+DEPDIR=.deps depmode=none /bin/bash $(SOURCE_DIR)/build-aux/depcomp \
+$(CC)
+$(CC)
+source='$(SOURCE_DIR)/gnulib-tests/test-futimens.c' object='test-futimens.o' libtool=no \
+DEPDIR=.deps depmode=none /bin/bash $(SOURCE_DIR)/build-aux/depcomp \
+$(CC)
+$(CC)
+source='$(SOURCE_DIR)/gnulib-tests/test-fwrite.c' object='test-fwrite.o' libtool=no \
+DEPDIR=.deps depmode=none /bin/bash $(SOURCE_DIR)/build-aux/depcomp \
+$(CC)
+$(CC)
+source='$(SOURCE_DIR)/gnulib-tests/test-getaddrinfo.c' object='test-getaddrinfo.o' libtool=no \
+DEPDIR=.deps depmode=none /bin/bash $(SOURCE_DIR)/build-aux/depcomp \
+$(CC)
+$(CC)
+source='$(SOURCE_DIR)/gnulib-tests/test-getcwd-lgpl.c' object='test-getcwd-lgpl.o' libtool=no \
+DEPDIR=.deps depmode=none /bin/bash $(SOURCE_DIR)/build-aux/depcomp \
+$(CC)
+$(CC)
+source='$(SOURCE_DIR)/gnulib-tests/test-getcwd.c' object='test-getcwd.o' libtool=no \
+DEPDIR=.deps depmode=none /bin/bash $(SOURCE_DIR)/build-aux/depcomp \
+$(CC)
+$(CC)
+source='$(SOURCE_DIR)/gnulib-tests/test-getdelim.c' object='test-getdelim.o' libtool=no \
+DEPDIR=.deps depmode=none /bin/bash $(SOURCE_DIR)/build-aux/depcomp \
+$(CC)
+$(CC)
+source='$(SOURCE_DIR)/gnulib-tests/test-getdtablesize.c' object='test-getdtablesize.o' libtool=no \
+DEPDIR=.deps depmode=none /bin/bash $(SOURCE_DIR)/build-aux/depcomp \
+$(CC)
+$(CC)
+source='$(SOURCE_DIR)/gnulib-tests/test-getgroups.c' object='test-getgroups.o' libtool=no \
+DEPDIR=.deps depmode=none /bin/bash $(SOURCE_DIR)/build-aux/depcomp \
+$(CC)
+$(CC)
+source='$(SOURCE_DIR)/gnulib-tests/test-gethostname.c' object='test-gethostname.o' libtool=no \
+DEPDIR=.deps depmode=none /bin/bash $(SOURCE_DIR)/build-aux/depcomp \
+$(CC)
+$(CC)
+source='$(SOURCE_DIR)/gnulib-tests/test-getline.c' object='test-getline.o' libtool=no \
+DEPDIR=.deps depmode=none /bin/bash $(SOURCE_DIR)/build-aux/depcomp \
+$(CC)
+$(CC)
+source='$(SOURCE_DIR)/gnulib-tests/test-getloadavg.c' object='test-getloadavg.o' libtool=no \
+DEPDIR=.deps depmode=none /bin/bash $(SOURCE_DIR)/build-aux/depcomp \
+$(CC)
+$(CC)
+source='$(SOURCE_DIR)/gnulib-tests/test-getlogin.c' object='test-getlogin.o' libtool=no \
+DEPDIR=.deps depmode=none /bin/bash $(SOURCE_DIR)/build-aux/depcomp \
+$(CC)
+"$(SOURCE_DIR)/gnulib-tests/test-getlogin.c", line 45: warning: statement not reached
+$(CC)
+source='$(SOURCE_DIR)/gnulib-tests/test-getndelim2.c' object='test-getndelim2.o' libtool=no \
+DEPDIR=.deps depmode=none /bin/bash $(SOURCE_DIR)/build-aux/depcomp \
+$(CC)
+$(CC)
+source='$(SOURCE_DIR)/gnulib-tests/test-getopt.c' object='test-getopt.o' libtool=no \
+DEPDIR=.deps depmode=none /bin/bash $(SOURCE_DIR)/build-aux/depcomp \
+$(CC)
+$(CC)
+source='$(SOURCE_DIR)/gnulib-tests/test-gettimeofday.c' object='test-gettimeofday.o' libtool=no \
+DEPDIR=.deps depmode=none /bin/bash $(SOURCE_DIR)/build-aux/depcomp \
+$(CC)
+$(CC)
+source='$(SOURCE_DIR)/gnulib-tests/test-hash.c' object='test-hash.o' libtool=no \
+DEPDIR=.deps depmode=none /bin/bash $(SOURCE_DIR)/build-aux/depcomp \
+$(CC)
+$(CC)
+source='$(SOURCE_DIR)/gnulib-tests/test-i-ring.c' object='test-i-ring.o' libtool=no \
+DEPDIR=.deps depmode=none /bin/bash $(SOURCE_DIR)/build-aux/depcomp \
+$(CC)
+$(CC)
+source='$(SOURCE_DIR)/gnulib-tests/test-iconv-h.c' object='test-iconv-h.o' libtool=no \
+DEPDIR=.deps depmode=none /bin/bash $(SOURCE_DIR)/build-aux/depcomp \
+$(CC)
+$(CC)
+source='$(SOURCE_DIR)/gnulib-tests/test-iconv.c' object='test-iconv.o' libtool=no \
+DEPDIR=.deps depmode=none /bin/bash $(SOURCE_DIR)/build-aux/depcomp \
+$(CC)
+$(CC)
+source='$(SOURCE_DIR)/gnulib-tests/test-ignore-value.c' object='test-ignore-value.o' libtool=no \
+DEPDIR=.deps depmode=none /bin/bash $(SOURCE_DIR)/build-aux/depcomp \
+$(CC)
+$(CC)
+source='$(SOURCE_DIR)/gnulib-tests/test-inet_ntop.c' object='test-inet_ntop.o' libtool=no \
+DEPDIR=.deps depmode=none /bin/bash $(SOURCE_DIR)/build-aux/depcomp \
+$(CC)
+$(CC)
+source='$(SOURCE_DIR)/gnulib-tests/test-inet_pton.c' object='test-inet_pton.o' libtool=no \
+DEPDIR=.deps depmode=none /bin/bash $(SOURCE_DIR)/build-aux/depcomp \
+$(CC)
+$(CC)
+source='$(SOURCE_DIR)/gnulib-tests/test-ino-map.c' object='test-ino-map.o' libtool=no \
+DEPDIR=.deps depmode=none /bin/bash $(SOURCE_DIR)/build-aux/depcomp \
+$(CC)
+$(CC)
+source='$(SOURCE_DIR)/gnulib-tests/test-intprops.c' object='test-intprops.o' libtool=no \
+DEPDIR=.deps depmode=none /bin/bash $(SOURCE_DIR)/build-aux/depcomp \
+$(CC)
+$(CC)
+source='$(SOURCE_DIR)/gnulib-tests/test-inttostr.c' object='test-inttostr.o' libtool=no \
+DEPDIR=.deps depmode=none /bin/bash $(SOURCE_DIR)/build-aux/depcomp \
+$(CC)
+$(CC)
+source='$(SOURCE_DIR)/gnulib-tests/test-inttypes.c' object='test-inttypes.o' libtool=no \
+DEPDIR=.deps depmode=none /bin/bash $(SOURCE_DIR)/build-aux/depcomp \
+$(CC)
+$(CC)
+source='$(SOURCE_DIR)/gnulib-tests/test-ioctl.c' object='test-ioctl.o' libtool=no \
+DEPDIR=.deps depmode=none /bin/bash $(SOURCE_DIR)/build-aux/depcomp \
+$(CC)
+$(CC)
+source='$(SOURCE_DIR)/gnulib-tests/test-isatty.c' object='test-isatty.o' libtool=no \
+DEPDIR=.deps depmode=none /bin/bash $(SOURCE_DIR)/build-aux/depcomp \
+$(CC)
+$(CC)
+source='$(SOURCE_DIR)/gnulib-tests/test-isblank.c' object='test-isblank.o' libtool=no \
+DEPDIR=.deps depmode=none /bin/bash $(SOURCE_DIR)/build-aux/depcomp \
+$(CC)
+$(CC)
+source='$(SOURCE_DIR)/gnulib-tests/test-isnand-nolibm.c' object='test-isnand-nolibm.o' libtool=no \
+DEPDIR=.deps depmode=none /bin/bash $(SOURCE_DIR)/build-aux/depcomp \
+$(CC)
+$(CC)
+source='$(SOURCE_DIR)/gnulib-tests/test-isnanf-nolibm.c' object='test-isnanf-nolibm.o' libtool=no \
+DEPDIR=.deps depmode=none /bin/bash $(SOURCE_DIR)/build-aux/depcomp \
+$(CC)
+$(CC)
+source='$(SOURCE_DIR)/gnulib-tests/test-isnanl-nolibm.c' object='test-isnanl-nolibm.o' libtool=no \
+DEPDIR=.deps depmode=none /bin/bash $(SOURCE_DIR)/build-aux/depcomp \
+$(CC)
+$(CC)
+source='$(SOURCE_DIR)/gnulib-tests/test-iswblank.c' object='test-iswblank.o' libtool=no \
+DEPDIR=.deps depmode=none /bin/bash $(SOURCE_DIR)/build-aux/depcomp \
+$(CC)
+$(CC)
+source='$(SOURCE_DIR)/gnulib-tests/test-langinfo.c' object='test-langinfo.o' libtool=no \
+DEPDIR=.deps depmode=none /bin/bash $(SOURCE_DIR)/build-aux/depcomp \
+$(CC)
+$(CC)
+source='$(SOURCE_DIR)/gnulib-tests/test-lchown.c' object='test-lchown.o' libtool=no \
+DEPDIR=.deps depmode=none /bin/bash $(SOURCE_DIR)/build-aux/depcomp \
+$(CC)
+$(CC)
+source='$(SOURCE_DIR)/gnulib-tests/test-link.c' object='test-link.o' libtool=no \
+DEPDIR=.deps depmode=none /bin/bash $(SOURCE_DIR)/build-aux/depcomp \
+$(CC)
+$(CC)
+source='$(SOURCE_DIR)/gnulib-tests/test-linkat.c' object='test-linkat.o' libtool=no \
+DEPDIR=.deps depmode=none /bin/bash $(SOURCE_DIR)/build-aux/depcomp \
+$(CC)
+$(CC)
+source='$(SOURCE_DIR)/gnulib-tests/test-listen.c' object='test-listen.o' libtool=no \
+DEPDIR=.deps depmode=none /bin/bash $(SOURCE_DIR)/build-aux/depcomp \
+$(CC)
+$(CC)
+source='$(SOURCE_DIR)/gnulib-tests/test-locale.c' object='test-locale.o' libtool=no \
+DEPDIR=.deps depmode=none /bin/bash $(SOURCE_DIR)/build-aux/depcomp \
+$(CC)
+$(CC)
+source='$(SOURCE_DIR)/gnulib-tests/test-localeconv.c' object='test-localeconv.o' libtool=no \
+DEPDIR=.deps depmode=none /bin/bash $(SOURCE_DIR)/build-aux/depcomp \
+$(CC)
+$(CC)
+source='$(SOURCE_DIR)/gnulib-tests/test-localename.c' object='test-localename.o' libtool=no \
+DEPDIR=.deps depmode=none /bin/bash $(SOURCE_DIR)/build-aux/depcomp \
+$(CC)
+$(CC)
+source='test-lock.c' object='test_lock-test-lock.o' libtool=no \
+DEPDIR=.deps depmode=none /bin/bash $(SOURCE_DIR)/build-aux/depcomp \
+$(CC)
+$(CC)
+source='$(SOURCE_DIR)/gnulib-tests/test-lseek.c' object='test-lseek.o' libtool=no \
+DEPDIR=.deps depmode=none /bin/bash $(SOURCE_DIR)/build-aux/depcomp \
+$(CC)
+$(CC)
+source='$(SOURCE_DIR)/gnulib-tests/test-lstat.c' object='test-lstat.o' libtool=no \
+DEPDIR=.deps depmode=none /bin/bash $(SOURCE_DIR)/build-aux/depcomp \
+$(CC)
+$(CC)
+source='$(SOURCE_DIR)/gnulib-tests/test-malloc-gnu.c' object='test-malloc-gnu.o' libtool=no \
+DEPDIR=.deps depmode=none /bin/bash $(SOURCE_DIR)/build-aux/depcomp \
+$(CC)
+$(CC)
+source='$(SOURCE_DIR)/gnulib-tests/test-malloca.c' object='test-malloca.o' libtool=no \
+DEPDIR=.deps depmode=none /bin/bash $(SOURCE_DIR)/build-aux/depcomp \
+$(CC)
+$(CC)
+source='$(SOURCE_DIR)/gnulib-tests/test-math.c' object='test-math.o' libtool=no \
+DEPDIR=.deps depmode=none /bin/bash $(SOURCE_DIR)/build-aux/depcomp \
+$(CC)
+$(CC)
+source='$(SOURCE_DIR)/gnulib-tests/test-mbrtowc.c' object='test-mbrtowc.o' libtool=no \
+DEPDIR=.deps depmode=none /bin/bash $(SOURCE_DIR)/build-aux/depcomp \
+$(CC)
+$(CC)
+source='$(SOURCE_DIR)/gnulib-tests/test-mbrtowc-w32.c' object='test-mbrtowc-w32.o' libtool=no \
+DEPDIR=.deps depmode=none /bin/bash $(SOURCE_DIR)/build-aux/depcomp \
+$(CC)
+$(CC)
+source='$(SOURCE_DIR)/gnulib-tests/test-mbsalign.c' object='test-mbsalign.o' libtool=no \
+DEPDIR=.deps depmode=none /bin/bash $(SOURCE_DIR)/build-aux/depcomp \
+$(CC)
+$(CC)
+source='$(SOURCE_DIR)/gnulib-tests/test-mbscasecmp.c' object='test-mbscasecmp.o' libtool=no \
+DEPDIR=.deps depmode=none /bin/bash $(SOURCE_DIR)/build-aux/depcomp \
+$(CC)
+$(CC)
+source='$(SOURCE_DIR)/gnulib-tests/test-mbsinit.c' object='test-mbsinit.o' libtool=no \
+DEPDIR=.deps depmode=none /bin/bash $(SOURCE_DIR)/build-aux/depcomp \
+$(CC)
+$(CC)
+source='$(SOURCE_DIR)/gnulib-tests/test-mbsrtowcs.c' object='test-mbsrtowcs.o' libtool=no \
+DEPDIR=.deps depmode=none /bin/bash $(SOURCE_DIR)/build-aux/depcomp \
+$(CC)
+$(CC)
+source='$(SOURCE_DIR)/gnulib-tests/test-mbsstr1.c' object='test-mbsstr1.o' libtool=no \
+DEPDIR=.deps depmode=none /bin/bash $(SOURCE_DIR)/build-aux/depcomp \
+$(CC)
+$(CC)
+source='$(SOURCE_DIR)/gnulib-tests/test-mbsstr2.c' object='test-mbsstr2.o' libtool=no \
+DEPDIR=.deps depmode=none /bin/bash $(SOURCE_DIR)/build-aux/depcomp \
+$(CC)
+$(CC)
+source='$(SOURCE_DIR)/gnulib-tests/test-mbsstr3.c' object='test-mbsstr3.o' libtool=no \
+DEPDIR=.deps depmode=none /bin/bash $(SOURCE_DIR)/build-aux/depcomp \
+$(CC)
+$(CC)
+source='$(SOURCE_DIR)/gnulib-tests/test-memcasecmp.c' object='test-memcasecmp.o' libtool=no \
+DEPDIR=.deps depmode=none /bin/bash $(SOURCE_DIR)/build-aux/depcomp \
+$(CC)
+$(CC)
+source='$(SOURCE_DIR)/gnulib-tests/test-memchr.c' object='test-memchr.o' libtool=no \
+DEPDIR=.deps depmode=none /bin/bash $(SOURCE_DIR)/build-aux/depcomp \
+$(CC)
+$(CC)
+source='$(SOURCE_DIR)/gnulib-tests/test-memchr2.c' object='test-memchr2.o' libtool=no \
+DEPDIR=.deps depmode=none /bin/bash $(SOURCE_DIR)/build-aux/depcomp \
+$(CC)
+$(CC)
+source='$(SOURCE_DIR)/gnulib-tests/test-memcoll.c' object='test-memcoll.o' libtool=no \
+DEPDIR=.deps depmode=none /bin/bash $(SOURCE_DIR)/build-aux/depcomp \
+$(CC)
+$(CC)
+source='$(SOURCE_DIR)/gnulib-tests/test-memrchr.c' object='test-memrchr.o' libtool=no \
+DEPDIR=.deps depmode=none /bin/bash $(SOURCE_DIR)/build-aux/depcomp \
+$(CC)
+$(CC)
+source='$(SOURCE_DIR)/gnulib-tests/test-mkdir.c' object='test-mkdir.o' libtool=no \
+DEPDIR=.deps depmode=none /bin/bash $(SOURCE_DIR)/build-aux/depcomp \
+$(CC)
+$(CC)
+source='$(SOURCE_DIR)/gnulib-tests/test-mkfifo.c' object='test-mkfifo.o' libtool=no \
+DEPDIR=.deps depmode=none /bin/bash $(SOURCE_DIR)/build-aux/depcomp \
+$(CC)
+$(CC)
+source='$(SOURCE_DIR)/gnulib-tests/test-mknod.c' object='test-mknod.o' libtool=no \
+DEPDIR=.deps depmode=none /bin/bash $(SOURCE_DIR)/build-aux/depcomp \
+$(CC)
+$(CC)
+source='$(SOURCE_DIR)/gnulib-tests/test-nanosleep.c' object='test-nanosleep.o' libtool=no \
+DEPDIR=.deps depmode=none /bin/bash $(SOURCE_DIR)/build-aux/depcomp \
+$(CC)
+$(CC)
+source='$(SOURCE_DIR)/gnulib-tests/test-netdb.c' object='test-netdb.o' libtool=no \
+DEPDIR=.deps depmode=none /bin/bash $(SOURCE_DIR)/build-aux/depcomp \
+$(CC)
+$(CC)
+source='$(SOURCE_DIR)/gnulib-tests/test-netinet_in.c' object='test-netinet_in.o' libtool=no \
+DEPDIR=.deps depmode=none /bin/bash $(SOURCE_DIR)/build-aux/depcomp \
+$(CC)
+$(CC)
+source='$(SOURCE_DIR)/gnulib-tests/test-nl_langinfo.c' object='test-nl_langinfo.o' libtool=no \
+DEPDIR=.deps depmode=none /bin/bash $(SOURCE_DIR)/build-aux/depcomp \
+$(CC)
+$(CC)
+source='$(SOURCE_DIR)/gnulib-tests/test-open.c' object='test-open.o' libtool=no \
+DEPDIR=.deps depmode=none /bin/bash $(SOURCE_DIR)/build-aux/depcomp \
+$(CC)
+$(CC)
+source='$(SOURCE_DIR)/gnulib-tests/test-openat-safer.c' object='test-openat-safer.o' libtool=no \
+DEPDIR=.deps depmode=none /bin/bash $(SOURCE_DIR)/build-aux/depcomp \
+$(CC)
+$(CC)
+source='$(SOURCE_DIR)/gnulib-tests/test-openat.c' object='test-openat.o' libtool=no \
+DEPDIR=.deps depmode=none /bin/bash $(SOURCE_DIR)/build-aux/depcomp \
+$(CC)
+$(CC)
+source='$(SOURCE_DIR)/gnulib-tests/test-parse-datetime.c' object='test-parse-datetime.o' libtool=no \
+DEPDIR=.deps depmode=none /bin/bash $(SOURCE_DIR)/build-aux/depcomp \
+$(CC)
+$(CC)
+source='$(SOURCE_DIR)/gnulib-tests/test-pathmax.c' object='test-pathmax.o' libtool=no \
+DEPDIR=.deps depmode=none /bin/bash $(SOURCE_DIR)/build-aux/depcomp \
+$(CC)
+$(CC)
+source='$(SOURCE_DIR)/gnulib-tests/test-perror.c' object='test-perror.o' libtool=no \
+DEPDIR=.deps depmode=none /bin/bash $(SOURCE_DIR)/build-aux/depcomp \
+$(CC)
+$(CC)
+source='$(SOURCE_DIR)/gnulib-tests/test-perror2.c' object='test-perror2.o' libtool=no \
+DEPDIR=.deps depmode=none /bin/bash $(SOURCE_DIR)/build-aux/depcomp \
+$(CC)
+$(CC)
+source='$(SOURCE_DIR)/gnulib-tests/test-pipe.c' object='test-pipe.o' libtool=no \
+DEPDIR=.deps depmode=none /bin/bash $(SOURCE_DIR)/build-aux/depcomp \
+$(CC)
+$(CC)
+source='$(SOURCE_DIR)/gnulib-tests/test-posixtm.c' object='test-posixtm.o' libtool=no \
+DEPDIR=.deps depmode=none /bin/bash $(SOURCE_DIR)/build-aux/depcomp \
+$(CC)
+$(CC)
+source='$(SOURCE_DIR)/gnulib-tests/test-printf-frexp.c' object='test-printf-frexp.o' libtool=no \
+DEPDIR=.deps depmode=none /bin/bash $(SOURCE_DIR)/build-aux/depcomp \
+$(CC)
+$(CC)
+source='$(SOURCE_DIR)/gnulib-tests/test-printf-frexpl.c' object='test-printf-frexpl.o' libtool=no \
+DEPDIR=.deps depmode=none /bin/bash $(SOURCE_DIR)/build-aux/depcomp \
+$(CC)
+$(CC)
+source='$(SOURCE_DIR)/gnulib-tests/test-priv-set.c' object='test-priv-set.o' libtool=no \
+DEPDIR=.deps depmode=none /bin/bash $(SOURCE_DIR)/build-aux/depcomp \
+$(CC)
+$(CC)
+source='$(SOURCE_DIR)/gnulib-tests/test-quotearg-simple.c' object='test-quotearg-simple.o' libtool=no \
+DEPDIR=.deps depmode=none /bin/bash $(SOURCE_DIR)/build-aux/depcomp \
+$(CC)
+$(CC)
+source='$(SOURCE_DIR)/gnulib-tests/test-raise.c' object='test-raise.o' libtool=no \
+DEPDIR=.deps depmode=none /bin/bash $(SOURCE_DIR)/build-aux/depcomp \
+$(CC)
+$(CC)
+source='$(SOURCE_DIR)/gnulib-tests/test-rand-isaac.c' object='test-rand-isaac.o' libtool=no \
+DEPDIR=.deps depmode=none /bin/bash $(SOURCE_DIR)/build-aux/depcomp \
+$(CC)
+$(CC)
+source='$(SOURCE_DIR)/gnulib-tests/test-read-file.c' object='test-read-file.o' libtool=no \
+DEPDIR=.deps depmode=none /bin/bash $(SOURCE_DIR)/build-aux/depcomp \
+$(CC)
+$(CC)
+source='$(SOURCE_DIR)/gnulib-tests/test-read.c' object='test-read.o' libtool=no \
+DEPDIR=.deps depmode=none /bin/bash $(SOURCE_DIR)/build-aux/depcomp \
+$(CC)
+$(CC)
+source='$(SOURCE_DIR)/gnulib-tests/test-readlink.c' object='test-readlink.o' libtool=no \
+DEPDIR=.deps depmode=none /bin/bash $(SOURCE_DIR)/build-aux/depcomp \
+$(CC)
+$(CC)
+source='$(SOURCE_DIR)/gnulib-tests/test-readlinkat.c' object='test-readlinkat.o' libtool=no \
+DEPDIR=.deps depmode=none /bin/bash $(SOURCE_DIR)/build-aux/depcomp \
+$(CC)
+$(CC)
+source='$(SOURCE_DIR)/gnulib-tests/test-readtokens.c' object='test-readtokens.o' libtool=no \
+DEPDIR=.deps depmode=none /bin/bash $(SOURCE_DIR)/build-aux/depcomp \
+$(CC)
+$(CC)
+source='$(SOURCE_DIR)/gnulib-tests/test-realloc-gnu.c' object='test-realloc-gnu.o' libtool=no \
+DEPDIR=.deps depmode=none /bin/bash $(SOURCE_DIR)/build-aux/depcomp \
+$(CC)
+$(CC)
+source='$(SOURCE_DIR)/gnulib-tests/test-regex.c' object='test-regex.o' libtool=no \
+DEPDIR=.deps depmode=none /bin/bash $(SOURCE_DIR)/build-aux/depcomp \
+$(CC)
+$(CC)
+source='$(SOURCE_DIR)/gnulib-tests/test-remove.c' object='test-remove.o' libtool=no \
+DEPDIR=.deps depmode=none /bin/bash $(SOURCE_DIR)/build-aux/depcomp \
+$(CC)
+$(CC)
+source='$(SOURCE_DIR)/gnulib-tests/test-rename.c' object='test-rename.o' libtool=no \
+DEPDIR=.deps depmode=none /bin/bash $(SOURCE_DIR)/build-aux/depcomp \
+$(CC)
+$(CC)
+source='$(SOURCE_DIR)/gnulib-tests/test-rmdir.c' object='test-rmdir.o' libtool=no \
+DEPDIR=.deps depmode=none /bin/bash $(SOURCE_DIR)/build-aux/depcomp \
+$(CC)
+$(CC)
+source='$(SOURCE_DIR)/gnulib-tests/test-sched.c' object='test-sched.o' libtool=no \
+DEPDIR=.deps depmode=none /bin/bash $(SOURCE_DIR)/build-aux/depcomp \
+$(CC)
+$(CC)
+source='$(SOURCE_DIR)/gnulib-tests/test-select.c' object='test-select.o' libtool=no \
+DEPDIR=.deps depmode=none /bin/bash $(SOURCE_DIR)/build-aux/depcomp \
+$(CC)
+$(CC)
+source='$(SOURCE_DIR)/gnulib-tests/test-select-fd.c' object='test-select-fd.o' libtool=no \
+DEPDIR=.deps depmode=none /bin/bash $(SOURCE_DIR)/build-aux/depcomp \
+$(CC)
+"$(SOURCE_DIR)/gnulib-tests/test-select-fd.c", line 47: warning: implicit function declaration: memset
+$(CC)
+source='$(SOURCE_DIR)/gnulib-tests/test-select-stdin.c' object='test-select-stdin.o' libtool=no \
+DEPDIR=.deps depmode=none /bin/bash $(SOURCE_DIR)/build-aux/depcomp \
+$(CC)
+"$(SOURCE_DIR)/gnulib-tests/test-select-stdin.c", line 44: warning: implicit function declaration: memset
+$(CC)
+source='$(SOURCE_DIR)/gnulib-tests/test-setenv.c' object='test-setenv.o' libtool=no \
+DEPDIR=.deps depmode=none /bin/bash $(SOURCE_DIR)/build-aux/depcomp \
+$(CC)
+$(CC)
+source='$(SOURCE_DIR)/gnulib-tests/test-setlocale1.c' object='test-setlocale1.o' libtool=no \
+DEPDIR=.deps depmode=none /bin/bash $(SOURCE_DIR)/build-aux/depcomp \
+$(CC)
+$(CC)
+source='$(SOURCE_DIR)/gnulib-tests/test-setlocale2.c' object='test-setlocale2.o' libtool=no \
+DEPDIR=.deps depmode=none /bin/bash $(SOURCE_DIR)/build-aux/depcomp \
+$(CC)
+$(CC)
+source='$(SOURCE_DIR)/gnulib-tests/test-setsockopt.c' object='test-setsockopt.o' libtool=no \
+DEPDIR=.deps depmode=none /bin/bash $(SOURCE_DIR)/build-aux/depcomp \
+$(CC)
+$(CC)
+source='$(SOURCE_DIR)/gnulib-tests/test-sigaction.c' object='test-sigaction.o' libtool=no \
+DEPDIR=.deps depmode=none /bin/bash $(SOURCE_DIR)/build-aux/depcomp \
+$(CC)
+$(CC)
+source='$(SOURCE_DIR)/gnulib-tests/test-signal-h.c' object='test-signal-h.o' libtool=no \
+DEPDIR=.deps depmode=none /bin/bash $(SOURCE_DIR)/build-aux/depcomp \
+$(CC)
+$(CC)
+source='$(SOURCE_DIR)/gnulib-tests/test-signbit.c' object='test-signbit.o' libtool=no \
+DEPDIR=.deps depmode=none /bin/bash $(SOURCE_DIR)/build-aux/depcomp \
+$(CC)
+$(CC)
+source='$(SOURCE_DIR)/gnulib-tests/test-sigprocmask.c' object='test-sigprocmask.o' libtool=no \
+DEPDIR=.deps depmode=none /bin/bash $(SOURCE_DIR)/build-aux/depcomp \
+$(CC)
+$(CC)
+source='$(SOURCE_DIR)/gnulib-tests/test-sleep.c' object='test-sleep.o' libtool=no \
+DEPDIR=.deps depmode=none /bin/bash $(SOURCE_DIR)/build-aux/depcomp \
+$(CC)
+$(CC)
+source='$(SOURCE_DIR)/gnulib-tests/test-snprintf.c' object='test-snprintf.o' libtool=no \
+DEPDIR=.deps depmode=none /bin/bash $(SOURCE_DIR)/build-aux/depcomp \
+$(CC)
+$(CC)
+source='$(SOURCE_DIR)/gnulib-tests/test-sockets.c' object='test-sockets.o' libtool=no \
+DEPDIR=.deps depmode=none /bin/bash $(SOURCE_DIR)/build-aux/depcomp \
+$(CC)
+$(CC)
+source='$(SOURCE_DIR)/gnulib-tests/test-stat.c' object='test-stat.o' libtool=no \
+DEPDIR=.deps depmode=none /bin/bash $(SOURCE_DIR)/build-aux/depcomp \
+$(CC)
+$(CC)
+source='$(SOURCE_DIR)/gnulib-tests/test-stat-time.c' object='test-stat-time.o' libtool=no \
+DEPDIR=.deps depmode=none /bin/bash $(SOURCE_DIR)/build-aux/depcomp \
+$(CC)
+$(CC)
+source='$(SOURCE_DIR)/gnulib-tests/test-statat.c' object='test-statat.o' libtool=no \
+DEPDIR=.deps depmode=none /bin/bash $(SOURCE_DIR)/build-aux/depcomp \
+$(CC)
+$(CC)
+source='$(SOURCE_DIR)/gnulib-tests/test-stdalign.c' object='test-stdalign.o' libtool=no \
+DEPDIR=.deps depmode=none /bin/bash $(SOURCE_DIR)/build-aux/depcomp \
+$(CC)
+$(CC)
+source='$(SOURCE_DIR)/gnulib-tests/test-stdbool.c' object='test-stdbool.o' libtool=no \
+DEPDIR=.deps depmode=none /bin/bash $(SOURCE_DIR)/build-aux/depcomp \
+$(CC)
+$(CC)
+source='$(SOURCE_DIR)/gnulib-tests/test-stddef.c' object='test-stddef.o' libtool=no \
+DEPDIR=.deps depmode=none /bin/bash $(SOURCE_DIR)/build-aux/depcomp \
+$(CC)
+$(CC)
+source='$(SOURCE_DIR)/gnulib-tests/test-stdint.c' object='test-stdint.o' libtool=no \
+DEPDIR=.deps depmode=none /bin/bash $(SOURCE_DIR)/build-aux/depcomp \
+$(CC)
+$(CC)
+source='$(SOURCE_DIR)/gnulib-tests/test-stdio.c' object='test-stdio.o' libtool=no \
+DEPDIR=.deps depmode=none /bin/bash $(SOURCE_DIR)/build-aux/depcomp \
+$(CC)
+$(CC)
+source='$(SOURCE_DIR)/gnulib-tests/test-stdlib.c' object='test-stdlib.o' libtool=no \
+DEPDIR=.deps depmode=none /bin/bash $(SOURCE_DIR)/build-aux/depcomp \
+$(CC)
+$(CC)
+source='$(SOURCE_DIR)/gnulib-tests/test-strerror.c' object='test-strerror.o' libtool=no \
+DEPDIR=.deps depmode=none /bin/bash $(SOURCE_DIR)/build-aux/depcomp \
+$(CC)
+$(CC)
+source='$(SOURCE_DIR)/gnulib-tests/test-strerror_r.c' object='test-strerror_r.o' libtool=no \
+DEPDIR=.deps depmode=none /bin/bash $(SOURCE_DIR)/build-aux/depcomp \
+$(CC)
+$(CC)
+source='$(SOURCE_DIR)/gnulib-tests/test-strftime.c' object='test-strftime.o' libtool=no \
+DEPDIR=.deps depmode=none /bin/bash $(SOURCE_DIR)/build-aux/depcomp \
+$(CC)
+$(CC)
+source='$(SOURCE_DIR)/gnulib-tests/test-striconv.c' object='test-striconv.o' libtool=no \
+DEPDIR=.deps depmode=none /bin/bash $(SOURCE_DIR)/build-aux/depcomp \
+$(CC)
+$(CC)
+source='$(SOURCE_DIR)/gnulib-tests/test-string.c' object='test-string.o' libtool=no \
+DEPDIR=.deps depmode=none /bin/bash $(SOURCE_DIR)/build-aux/depcomp \
+$(CC)
+$(CC)
+source='$(SOURCE_DIR)/gnulib-tests/test-strncat.c' object='test-strncat.o' libtool=no \
+DEPDIR=.deps depmode=none /bin/bash $(SOURCE_DIR)/build-aux/depcomp \
+$(CC)
+$(CC)
+source='$(SOURCE_DIR)/gnulib-tests/test-strnlen.c' object='test-strnlen.o' libtool=no \
+DEPDIR=.deps depmode=none /bin/bash $(SOURCE_DIR)/build-aux/depcomp \
+$(CC)
+$(CC)
+source='$(SOURCE_DIR)/gnulib-tests/test-strsignal.c' object='test-strsignal.o' libtool=no \
+DEPDIR=.deps depmode=none /bin/bash $(SOURCE_DIR)/build-aux/depcomp \
+$(CC)
+$(CC)
+source='$(SOURCE_DIR)/gnulib-tests/test-strtod.c' object='test-strtod.o' libtool=no \
+DEPDIR=.deps depmode=none /bin/bash $(SOURCE_DIR)/build-aux/depcomp \
+$(CC)
+$(CC)
+source='$(SOURCE_DIR)/gnulib-tests/test-strtoimax.c' object='test-strtoimax.o' libtool=no \
+DEPDIR=.deps depmode=none /bin/bash $(SOURCE_DIR)/build-aux/depcomp \
+$(CC)
+$(CC)
+source='$(SOURCE_DIR)/gnulib-tests/test-strtoll.c' object='test-strtoll.o' libtool=no \
+DEPDIR=.deps depmode=none /bin/bash $(SOURCE_DIR)/build-aux/depcomp \
+$(CC)
+$(CC)
+source='$(SOURCE_DIR)/gnulib-tests/test-strtoull.c' object='test-strtoull.o' libtool=no \
+DEPDIR=.deps depmode=none /bin/bash $(SOURCE_DIR)/build-aux/depcomp \
+$(CC)
+$(CC)
+source='$(SOURCE_DIR)/gnulib-tests/test-strtoumax.c' object='test-strtoumax.o' libtool=no \
+DEPDIR=.deps depmode=none /bin/bash $(SOURCE_DIR)/build-aux/depcomp \
+$(CC)
+$(CC)
+source='$(SOURCE_DIR)/gnulib-tests/test-symlink.c' object='test-symlink.o' libtool=no \
+DEPDIR=.deps depmode=none /bin/bash $(SOURCE_DIR)/build-aux/depcomp \
+$(CC)
+$(CC)
+source='$(SOURCE_DIR)/gnulib-tests/test-symlinkat.c' object='test-symlinkat.o' libtool=no \
+DEPDIR=.deps depmode=none /bin/bash $(SOURCE_DIR)/build-aux/depcomp \
+$(CC)
+$(CC)
+source='$(SOURCE_DIR)/gnulib-tests/test-sys_ioctl.c' object='test-sys_ioctl.o' libtool=no \
+DEPDIR=.deps depmode=none /bin/bash $(SOURCE_DIR)/build-aux/depcomp \
+$(CC)
+$(CC)
+source='$(SOURCE_DIR)/gnulib-tests/test-sys_resource.c' object='test-sys_resource.o' libtool=no \
+DEPDIR=.deps depmode=none /bin/bash $(SOURCE_DIR)/build-aux/depcomp \
+$(CC)
+$(CC)
+source='$(SOURCE_DIR)/gnulib-tests/test-sys_select.c' object='test-sys_select.o' libtool=no \
+DEPDIR=.deps depmode=none /bin/bash $(SOURCE_DIR)/build-aux/depcomp \
+$(CC)
+$(CC)
+source='$(SOURCE_DIR)/gnulib-tests/test-sys_socket.c' object='test-sys_socket.o' libtool=no \
+DEPDIR=.deps depmode=none /bin/bash $(SOURCE_DIR)/build-aux/depcomp \
+$(CC)
+$(CC)
+source='$(SOURCE_DIR)/gnulib-tests/test-sys_stat.c' object='test-sys_stat.o' libtool=no \
+DEPDIR=.deps depmode=none /bin/bash $(SOURCE_DIR)/build-aux/depcomp \
+$(CC)
+$(CC)
+source='$(SOURCE_DIR)/gnulib-tests/test-sys_time.c' object='test-sys_time.o' libtool=no \
+DEPDIR=.deps depmode=none /bin/bash $(SOURCE_DIR)/build-aux/depcomp \
+$(CC)
+$(CC)
+source='$(SOURCE_DIR)/gnulib-tests/test-sys_types.c' object='test-sys_types.o' libtool=no \
+DEPDIR=.deps depmode=none /bin/bash $(SOURCE_DIR)/build-aux/depcomp \
+$(CC)
+$(CC)
+source='$(SOURCE_DIR)/gnulib-tests/test-sys_uio.c' object='test-sys_uio.o' libtool=no \
+DEPDIR=.deps depmode=none /bin/bash $(SOURCE_DIR)/build-aux/depcomp \
+$(CC)
+$(CC)
+source='$(SOURCE_DIR)/gnulib-tests/test-sys_utsname.c' object='test-sys_utsname.o' libtool=no \
+DEPDIR=.deps depmode=none /bin/bash $(SOURCE_DIR)/build-aux/depcomp \
+$(CC)
+$(CC)
+source='$(SOURCE_DIR)/gnulib-tests/test-sys_wait.c' object='test-sys_wait.o' libtool=no \
+DEPDIR=.deps depmode=none /bin/bash $(SOURCE_DIR)/build-aux/depcomp \
+$(CC)
+$(CC)
+source='$(SOURCE_DIR)/gnulib-tests/test-termios.c' object='test-termios.o' libtool=no \
+DEPDIR=.deps depmode=none /bin/bash $(SOURCE_DIR)/build-aux/depcomp \
+$(CC)
+$(CC)
+source='$(SOURCE_DIR)/gnulib-tests/test-thread_self.c' object='test-thread_self.o' libtool=no \
+DEPDIR=.deps depmode=none /bin/bash $(SOURCE_DIR)/build-aux/depcomp \
+$(CC)
+$(CC)
+source='$(SOURCE_DIR)/gnulib-tests/test-thread_create.c' object='test-thread_create.o' libtool=no \
+DEPDIR=.deps depmode=none /bin/bash $(SOURCE_DIR)/build-aux/depcomp \
+$(CC)
+$(CC)
+source='$(SOURCE_DIR)/gnulib-tests/test-time.c' object='test-time.o' libtool=no \
+DEPDIR=.deps depmode=none /bin/bash $(SOURCE_DIR)/build-aux/depcomp \
+$(CC)
+$(CC)
+source='test-tls.c' object='test_tls-test-tls.o' libtool=no \
+DEPDIR=.deps depmode=none /bin/bash $(SOURCE_DIR)/build-aux/depcomp \
+$(CC)
+$(CC)
+source='$(SOURCE_DIR)/gnulib-tests/test-u64.c' object='test-u64.o' libtool=no \
+DEPDIR=.deps depmode=none /bin/bash $(SOURCE_DIR)/build-aux/depcomp \
+$(CC)
+$(CC)
+source='$(SOURCE_DIR)/gnulib-tests/test-uname.c' object='test-uname.o' libtool=no \
+DEPDIR=.deps depmode=none /bin/bash $(SOURCE_DIR)/build-aux/depcomp \
+$(CC)
+$(CC)
+source='$(SOURCE_DIR)/gnulib-tests/test-dup-safer.c' object='test-dup-safer.o' libtool=no \
+DEPDIR=.deps depmode=none /bin/bash $(SOURCE_DIR)/build-aux/depcomp \
+$(CC)
+$(CC)
+source='$(SOURCE_DIR)/gnulib-tests/test-unistd.c' object='test-unistd.o' libtool=no \
+DEPDIR=.deps depmode=none /bin/bash $(SOURCE_DIR)/build-aux/depcomp \
+$(CC)
+$(CC)
+source='$(SOURCE_DIR)/gnulib-tests/unistr/test-u8-mbtoucr.c' object='unistr/test-u8-mbtoucr.o' libtool=no \
+DEPDIR=.deps depmode=none /bin/bash $(SOURCE_DIR)/build-aux/depcomp \
+$(CC)
+$(CC)
+source='$(SOURCE_DIR)/gnulib-tests/unistr/test-u8-uctomb.c' object='unistr/test-u8-uctomb.o' libtool=no \
+DEPDIR=.deps depmode=none /bin/bash $(SOURCE_DIR)/build-aux/depcomp \
+$(CC)
+$(CC)
+source='$(SOURCE_DIR)/gnulib-tests/uniwidth/test-uc_width.c' object='uniwidth/test-uc_width.o' libtool=no \
+DEPDIR=.deps depmode=none /bin/bash $(SOURCE_DIR)/build-aux/depcomp \
+$(CC)
+$(CC)
+source='$(SOURCE_DIR)/gnulib-tests/uniwidth/test-uc_width2.c' object='uniwidth/test-uc_width2.o' libtool=no \
+DEPDIR=.deps depmode=none /bin/bash $(SOURCE_DIR)/build-aux/depcomp \
+$(CC)
+$(CC)
+source='$(SOURCE_DIR)/gnulib-tests/test-unlink.c' object='test-unlink.o' libtool=no \
+DEPDIR=.deps depmode=none /bin/bash $(SOURCE_DIR)/build-aux/depcomp \
+$(CC)
+$(CC)
+source='$(SOURCE_DIR)/gnulib-tests/test-unlinkat.c' object='test-unlinkat.o' libtool=no \
+DEPDIR=.deps depmode=none /bin/bash $(SOURCE_DIR)/build-aux/depcomp \
+$(CC)
+$(CC)
+source='$(SOURCE_DIR)/gnulib-tests/test-unsetenv.c' object='test-unsetenv.o' libtool=no \
+DEPDIR=.deps depmode=none /bin/bash $(SOURCE_DIR)/build-aux/depcomp \
+$(CC)
+$(CC)
+source='$(SOURCE_DIR)/gnulib-tests/test-userspec.c' object='test-userspec.o' libtool=no \
+DEPDIR=.deps depmode=none /bin/bash $(SOURCE_DIR)/build-aux/depcomp \
+$(CC)
+"$(SOURCE_DIR)/gnulib-tests/test-userspec.c", line 48: warning: initializer will be sign-extended: -1
+"$(SOURCE_DIR)/gnulib-tests/test-userspec.c", line 48: warning: initializer will be sign-extended: -1
+"$(SOURCE_DIR)/gnulib-tests/test-userspec.c", line 49: warning: initializer will be sign-extended: -1
+"$(SOURCE_DIR)/gnulib-tests/test-userspec.c", line 49: warning: initializer will be sign-extended: -1
+"$(SOURCE_DIR)/gnulib-tests/test-userspec.c", line 51: warning: initializer will be sign-extended: -1
+"$(SOURCE_DIR)/gnulib-tests/test-userspec.c", line 52: warning: initializer will be sign-extended: -1
+"$(SOURCE_DIR)/gnulib-tests/test-userspec.c", line 53: warning: initializer will be sign-extended: -1
+$(CC)
+source='$(SOURCE_DIR)/gnulib-tests/test-utimens.c' object='test-utimens.o' libtool=no \
+DEPDIR=.deps depmode=none /bin/bash $(SOURCE_DIR)/build-aux/depcomp \
+$(CC)
+$(CC)
+source='$(SOURCE_DIR)/gnulib-tests/test-utimensat.c' object='test-utimensat.o' libtool=no \
+DEPDIR=.deps depmode=none /bin/bash $(SOURCE_DIR)/build-aux/depcomp \
+$(CC)
+$(CC)
+source='$(SOURCE_DIR)/gnulib-tests/test-vasnprintf.c' object='test-vasnprintf.o' libtool=no \
+DEPDIR=.deps depmode=none /bin/bash $(SOURCE_DIR)/build-aux/depcomp \
+$(CC)
+$(CC)
+source='$(SOURCE_DIR)/gnulib-tests/test-vasprintf-posix.c' object='test-vasprintf-posix.o' libtool=no \
+DEPDIR=.deps depmode=none /bin/bash $(SOURCE_DIR)/build-aux/depcomp \
+$(CC)
+$(CC)
+source='$(SOURCE_DIR)/gnulib-tests/test-vasprintf.c' object='test-vasprintf.o' libtool=no \
+DEPDIR=.deps depmode=none /bin/bash $(SOURCE_DIR)/build-aux/depcomp \
+$(CC)
+$(CC)
+source='$(SOURCE_DIR)/gnulib-tests/test-verify.c' object='test-verify.o' libtool=no \
+DEPDIR=.deps depmode=none /bin/bash $(SOURCE_DIR)/build-aux/depcomp \
+$(CC)
+$(CC)
+source='$(SOURCE_DIR)/gnulib-tests/test-version-etc.c' object='test-version-etc.o' libtool=no \
+DEPDIR=.deps depmode=none /bin/bash $(SOURCE_DIR)/build-aux/depcomp \
+$(CC)
+$(CC)
+source='$(SOURCE_DIR)/gnulib-tests/test-vfprintf-posix.c' object='test-vfprintf-posix.o' libtool=no \
+DEPDIR=.deps depmode=none /bin/bash $(SOURCE_DIR)/build-aux/depcomp \
+$(CC)
+$(CC)
+source='$(SOURCE_DIR)/gnulib-tests/test-vprintf-posix.c' object='test-vprintf-posix.o' libtool=no \
+DEPDIR=.deps depmode=none /bin/bash $(SOURCE_DIR)/build-aux/depcomp \
+$(CC)
+$(CC)
+source='$(SOURCE_DIR)/gnulib-tests/test-wchar.c' object='test-wchar.o' libtool=no \
+DEPDIR=.deps depmode=none /bin/bash $(SOURCE_DIR)/build-aux/depcomp \
+$(CC)
+$(CC)
+source='$(SOURCE_DIR)/gnulib-tests/test-wcrtomb.c' object='test-wcrtomb.o' libtool=no \
+DEPDIR=.deps depmode=none /bin/bash $(SOURCE_DIR)/build-aux/depcomp \
+$(CC)
+$(CC)
+source='$(SOURCE_DIR)/gnulib-tests/test-wcrtomb-w32.c' object='test-wcrtomb-w32.o' libtool=no \
+DEPDIR=.deps depmode=none /bin/bash $(SOURCE_DIR)/build-aux/depcomp \
+$(CC)
+$(CC)
+source='$(SOURCE_DIR)/gnulib-tests/test-wctype-h.c' object='test-wctype-h.o' libtool=no \
+DEPDIR=.deps depmode=none /bin/bash $(SOURCE_DIR)/build-aux/depcomp \
+$(CC)
+$(CC)
+source='$(SOURCE_DIR)/gnulib-tests/test-wcwidth.c' object='test-wcwidth.o' libtool=no \
+DEPDIR=.deps depmode=none /bin/bash $(SOURCE_DIR)/build-aux/depcomp \
+$(CC)
+$(CC)
+source='$(SOURCE_DIR)/gnulib-tests/test-write.c' object='test-write.o' libtool=no \
+DEPDIR=.deps depmode=none /bin/bash $(SOURCE_DIR)/build-aux/depcomp \
+$(CC)
+$(CC)
+source='$(SOURCE_DIR)/gnulib-tests/test-xalloc-die.c' object='test-xalloc-die.o' libtool=no \
+DEPDIR=.deps depmode=none /bin/bash $(SOURCE_DIR)/build-aux/depcomp \
+$(CC)
+"$(SOURCE_DIR)/gnulib-tests/test-xalloc-die.c", line 29: warning: statement not reached
+$(CC)
+source='$(SOURCE_DIR)/gnulib-tests/test-xfprintf-posix.c' object='test-xfprintf-posix.o' libtool=no \
+DEPDIR=.deps depmode=none /bin/bash $(SOURCE_DIR)/build-aux/depcomp \
+$(CC)
+$(CC)
+source='$(SOURCE_DIR)/gnulib-tests/test-xprintf-posix.c' object='test-xprintf-posix.o' libtool=no \
+DEPDIR=.deps depmode=none /bin/bash $(SOURCE_DIR)/build-aux/depcomp \
+$(CC)
+$(CC)
+source='$(SOURCE_DIR)/gnulib-tests/test-xstrtoimax.c' object='test-xstrtoimax.o' libtool=no \
+DEPDIR=.deps depmode=none /bin/bash $(SOURCE_DIR)/build-aux/depcomp \
+$(CC)
+$(CC)
+source='$(SOURCE_DIR)/gnulib-tests/test-xstrtol.c' object='test-xstrtol.o' libtool=no \
+DEPDIR=.deps depmode=none /bin/bash $(SOURCE_DIR)/build-aux/depcomp \
+$(CC)
+$(CC)
+source='$(SOURCE_DIR)/gnulib-tests/test-xstrtoul.c' object='test-xstrtoul.o' libtool=no \
+DEPDIR=.deps depmode=none /bin/bash $(SOURCE_DIR)/build-aux/depcomp \
+$(CC)
+$(CC)
+source='$(SOURCE_DIR)/gnulib-tests/test-xstrtoumax.c' object='test-xstrtoumax.o' libtool=no \
+DEPDIR=.deps depmode=none /bin/bash $(SOURCE_DIR)/build-aux/depcomp \
+$(CC)
+$(CC)
+source='test-xvasprintf.c' object='test_xvasprintf-test-xvasprintf.o' libtool=no \
+DEPDIR=.deps depmode=none /bin/bash $(SOURCE_DIR)/build-aux/depcomp \
+$(CC)
+$(CC)
+source='$(SOURCE_DIR)/gnulib-tests/test-yesno.c' object='test-yesno.o' libtool=no \
+DEPDIR=.deps depmode=none /bin/bash $(SOURCE_DIR)/build-aux/depcomp \
+$(CC)
+$(CC)
+make[6]: Leaving directory `$(@D)/gnulib-tests'
+/usr/gnu/bin/make  check-TESTS
+make[6]: Entering directory `$(@D)/gnulib-tests'
+make[7]: Entering directory `$(@D)/gnulib-tests'
+PASS: test-accept
+PASS: test-file-has-acl.sh
+PASS: test-file-has-acl-1.sh
+PASS: test-file-has-acl-2.sh
+PASS: test-set-mode-acl.sh
+PASS: test-set-mode-acl-1.sh
+PASS: test-set-mode-acl-2.sh
+PASS: test-copy-acl.sh
+PASS: test-copy-acl-1.sh
+PASS: test-copy-acl-2.sh
+PASS: test-alignof
+PASS: test-alloca-opt
+PASS: test-areadlink
+PASS: test-areadlink-with-size
+PASS: test-areadlinkat
+PASS: test-argmatch
+PASS: test-argv-iter
+PASS: test-arpa_inet
+PASS: test-base64
+PASS: test-binary-io.sh
+PASS: test-bind
+PASS: test-bitrotate
+PASS: test-btowc1.sh
+PASS: test-btowc2.sh
+PASS: test-c-ctype
+PASS: test-c-strcase.sh
+PASS: test-calloc-gnu
+PASS: test-canonicalize
+PASS: test-chdir
+PASS: test-chown
+PASS: test-cloexec
+PASS: test-close
+PASS: test-closein.sh
+PASS: test-connect
+PASS: test-md5
+PASS: test-sha1
+PASS: test-ctype
+PASS: test-di-set
+PASS: test-dirent-safer
+PASS: test-dirent
+PASS: test-dirname
+PASS: test-dup
+PASS: test-dup2
+PASS: test-environ
+PASS: test-errno
+PASS: test-exclude1.sh
+PASS: test-exclude2.sh
+PASS: test-exclude3.sh
+PASS: test-exclude4.sh
+PASS: test-exclude5.sh
+PASS: test-exclude6.sh
+PASS: test-exclude7.sh
+PASS: test-exclude8.sh
+PASS: test-faccessat
+PASS: test-fadvise
+PASS: test-fchdir
+PASS: test-fchmodat
+PASS: test-fchownat
+PASS: test-fclose
+PASS: test-fcntl-h
+PASS: test-fcntl-safer
+PASS: test-fcntl
+PASS: test-fdatasync
+PASS: test-fdopen
+PASS: test-fdopendir
+PASS: test-fdutimensat
+PASS: test-fflush
+PASS: test-fflush2.sh
+PASS: test-fgetc
+PASS: test-filenamecat
+PASS: test-filevercmp
+PASS: test-float
+PASS: test-fnmatch
+PASS: test-fopen-safer
+PASS: test-fopen
+PASS: test-fpending.sh
+PASS: test-fpurge
+PASS: test-fputc
+PASS: test-fread
+PASS: test-freadahead.sh
+PASS: test-freading
+PASS: test-freadptr.sh
+PASS: test-freadptr2.sh
+PASS: test-freadseek.sh
+PASS: test-freopen-safer
+PASS: test-freopen
+PASS: test-frexp-nolibm
+PASS: test-frexpl-nolibm
+PASS: test-fseek.sh
+PASS: test-fseek2.sh
+PASS: test-fseeko.sh
+PASS: test-fseeko2.sh
+PASS: test-fseeko3.sh
+PASS: test-fseeko4.sh
+PASS: test-fseterr
+PASS: test-fstat
+PASS: test-fstatat
+PASS: test-fsync
+PASS: test-ftell.sh
+PASS: test-ftell2.sh
+PASS: test-ftell3
+PASS: test-ftello.sh
+PASS: test-ftello2.sh
+PASS: test-ftello3
+PASS: test-ftello4.sh
+PASS: test-ftruncate.sh
+PASS: test-futimens
+PASS: test-fwrite
+PASS: test-getaddrinfo
+PASS: test-getcwd-lgpl
+PASS: test-getcwd.sh
+PASS: test-getdelim
+PASS: test-getdtablesize
+PASS: test-getgroups
+PASS: test-gethostname
+PASS: test-getline
+PASS: test-getloadavg
+PASS: test-getlogin
+PASS: test-getndelim2
+PASS: test-getopt
+PASS: test-gettimeofday
+PASS: test-hash
+PASS: test-i-ring
+PASS: test-iconv-h
+PASS: test-iconv
+PASS: test-ignore-value
+PASS: test-inet_ntop
+PASS: test-inet_pton
+PASS: test-ino-map
+PASS: test-intprops
+PASS: test-inttostr
+PASS: test-inttypes
+PASS: test-ioctl
+PASS: test-isatty
+PASS: test-isblank
+PASS: test-isnand-nolibm
+PASS: test-isnanf-nolibm
+PASS: test-isnanl-nolibm
+PASS: test-iswblank
+PASS: test-langinfo
+PASS: test-lchown
+PASS: test-link
+PASS: test-linkat
+PASS: test-listen
+PASS: test-locale
+PASS: test-localeconv
+PASS: test-localename
+PASS: test-lock
+PASS: test-lseek.sh
+PASS: test-lstat
+PASS: test-malloc-gnu
+PASS: test-malloca
+PASS: test-math
+PASS: test-mbrtowc1.sh
+PASS: test-mbrtowc2.sh
+PASS: test-mbrtowc3.sh
+PASS: test-mbrtowc4.sh
+SKIP: test-mbrtowc-w32-1.sh
+SKIP: test-mbrtowc-w32-2.sh
+SKIP: test-mbrtowc-w32-3.sh
+SKIP: test-mbrtowc-w32-4.sh
+SKIP: test-mbrtowc-w32-5.sh
+/bin/bash: line 1:
+FAIL: test-mbsalign
+SKIP: test-mbscasecmp.sh
+PASS: test-mbsinit.sh
+PASS: test-mbsrtowcs1.sh
+PASS: test-mbsrtowcs2.sh
+PASS: test-mbsrtowcs3.sh
+PASS: test-mbsrtowcs4.sh
+PASS: test-mbsstr1
+PASS: test-mbsstr2.sh
+PASS: test-mbsstr3.sh
+PASS: test-memcasecmp
+PASS: test-memchr
+PASS: test-memchr2
+PASS: test-memcoll
+PASS: test-memrchr
+PASS: test-mkdir
+PASS: test-mkfifo
+PASS: test-mknod
+PASS: test-nanosleep
+PASS: test-netdb
+PASS: test-netinet_in
+PASS: test-nl_langinfo.sh
+PASS: test-open
+PASS: test-openat-safer
+PASS: test-openat
+PASS: test-parse-datetime
+PASS: test-pathmax
+PASS: test-perror.sh
+PASS: test-perror2
+PASS: test-pipe
+FAIL: test-posixtm
+PASS: test-printf-frexp
+PASS: test-printf-frexpl
+PASS: test-priv-set
+PASS: test-quotearg-simple
+PASS: test-raise
+PASS: test-rand-isaac
+PASS: test-read-file
+PASS: test-read
+PASS: test-readlink
+PASS: test-readlinkat
+PASS: test-readtokens.sh
+PASS: test-realloc-gnu
+PASS: test-regex
+PASS: test-remove
+PASS: test-rename
+PASS: test-rmdir
+PASS: test-sched
+PASS: test-select
+PASS: test-select-in.sh
+PASS: test-select-out.sh
+PASS: test-setenv
+PASS: test-setlocale1.sh
+PASS: test-setlocale2.sh
+PASS: test-setsockopt
+PASS: test-sigaction
+PASS: test-signal-h
+PASS: test-signbit
+PASS: test-sigprocmask
+PASS: test-sleep
+PASS: test-snprintf
+PASS: test-sockets
+PASS: test-stat
+PASS: test-stat-time
+PASS: test-statat
+SKIP: test-stdalign
+PASS: test-stdbool
+PASS: test-stddef
+PASS: test-stdint
+PASS: test-stdio
+PASS: test-stdlib
+PASS: test-strerror
+PASS: test-strerror_r
+PASS: test-strftime
+PASS: test-striconv
+PASS: test-string
+PASS: test-strncat
+PASS: test-strnlen
+PASS: test-strsignal
+PASS: test-strtod
+PASS: test-strtoimax
+PASS: test-strtoll
+PASS: test-strtoull
+PASS: test-strtoumax
+PASS: test-symlink
+PASS: test-symlinkat
+PASS: test-sys_ioctl
+PASS: test-sys_resource
+PASS: test-sys_select
+PASS: test-sys_socket
+PASS: test-sys_stat
+PASS: test-sys_time
+PASS: test-sys_types
+PASS: test-sys_uio
+PASS: test-sys_utsname
+PASS: test-sys_wait
+PASS: test-termios
+PASS: test-init.sh
+PASS: test-thread_self
+PASS: test-thread_create
+PASS: test-time
+PASS: test-tls
+PASS: test-u64
+PASS: test-uname
+PASS: test-dup-safer
+PASS: test-unistd
+PASS: test-u8-mbtoucr
+PASS: test-u8-uctomb
+PASS: test-uc_width
+PASS: uniwidth/test-uc_width2.sh
+PASS: test-unlink
+PASS: test-unlinkat
+PASS: test-unsetenv
+PASS: test-update-copyright.sh
+PASS: test-userspec
+PASS: test-utimens
+PASS: test-utimensat
+PASS: test-vasnprintf
+PASS: test-vasprintf-posix
+PASS: test-vasprintf
+PASS: test-vc-list-files-git.sh
+PASS: test-vc-list-files-cvs.sh
+PASS: test-verify
+PASS: test-verify.sh
+PASS: test-version-etc.sh
+PASS: test-vfprintf-posix.sh
+PASS: test-vprintf-posix.sh
+PASS: test-wchar
+PASS: test-wcrtomb.sh
+SKIP: test-wcrtomb-w32-1.sh
+SKIP: test-wcrtomb-w32-2.sh
+SKIP: test-wcrtomb-w32-3.sh
+SKIP: test-wcrtomb-w32-4.sh
+SKIP: test-wcrtomb-w32-5.sh
+PASS: test-wctype-h
+PASS: test-wcwidth
+PASS: test-write
+PASS: test-xalloc-die.sh
+PASS: test-xprintf-posix.sh
+PASS: test-xstrtoimax.sh
+PASS: test-xstrtol.sh
+PASS: test-xstrtoumax.sh
+PASS: test-xvasprintf
+PASS: test-yesno.sh
+=====================================================
+   GNU coreutils 8.23: gnulib-tests/test-suite.log   
+=====================================================
+
+2 of 294 tests failed.  (12 tests were not run).  
+
+.. contents:: :depth: 2
+
+
+SKIP: test-mbrtowc-w32-1.sh (exit: 77)
+======================================
+
+Skipping test: not a native Windows system
+
+SKIP: test-mbrtowc-w32-2.sh (exit: 77)
+======================================
+
+Skipping test: not a native Windows system
+
+SKIP: test-mbrtowc-w32-3.sh (exit: 77)
+======================================
+
+Skipping test: not a native Windows system
+
+SKIP: test-mbrtowc-w32-4.sh (exit: 77)
+======================================
+
+Skipping test: not a native Windows system
+
+SKIP: test-mbrtowc-w32-5.sh (exit: 77)
+======================================
+
+Skipping test: not a native Windows system
+
+FAIL: test-mbsalign (exit: 134)
+===============================
+
+$(SOURCE_DIR)/gnulib-tests/test-mbsalign.c:116: assertion 'n == 9' failed
+
+SKIP: test-mbscasecmp.sh (exit: 77)
+===================================
+
+Skipping test: no turkish Unicode locale is installed
+
+FAIL: test-posixtm (exit: 1)
+============================
+
+000001010000.00 mismatch (-: actual; +:expected)
+--62167132800
++-62167219200
+000012312359.59 return value mismatch: got 0, expected 1
+
+SKIP: test-stdalign (exit: 77)
+==============================
+
+Skipping test: known Sun C compiler bug
+
+SKIP: test-wcrtomb-w32-1.sh (exit: 77)
+======================================
+
+Skipping test: not a native Windows system
+
+SKIP: test-wcrtomb-w32-2.sh (exit: 77)
+======================================
+
+Skipping test: not a native Windows system
+
+SKIP: test-wcrtomb-w32-3.sh (exit: 77)
+======================================
+
+Skipping test: not a native Windows system
+
+SKIP: test-wcrtomb-w32-4.sh (exit: 77)
+======================================
+
+Skipping test: not a native Windows system
+
+SKIP: test-wcrtomb-w32-5.sh (exit: 77)
+======================================
+
+Skipping test: not a native Windows system
+======================================
+2 of 294 tests failed
+(12 tests were not run)
+See gnulib-tests/test-suite.log
+Please report to [email protected]
+======================================
+make[7]: *** [test-suite.log] Error 1
+make[7]: Leaving directory `$(@D)/gnulib-tests'
+make[6]: *** [check-TESTS] Error 2
+make[6]: Leaving directory `$(@D)/gnulib-tests'
+make[5]: *** [check-am] Error 2
+make[5]: Leaving directory `$(@D)/gnulib-tests'
+make[4]: *** [check-recursive] Error 1
+make[4]: Leaving directory `$(@D)/gnulib-tests'
+make[3]: *** [check] Error 2
+make[3]: Leaving directory `$(@D)/gnulib-tests'
+make[2]: *** [check-recursive] Error 1
+make[2]: Leaving directory `$(@D)'
+make[1]: *** [check] Error 2
+make[1]: Leaving directory `$(@D)'