25674598 Update doxygen to version 1.8.13
authorRich Burridge <rich.burridge@oracle.com>
Fri, 17 Mar 2017 10:32:56 -0700
changeset 7772 a5abee83989d
parent 7771 46912a8a1f29
child 7773 06dfb4c9683d
25674598 Update doxygen to version 1.8.13 25674683 Updating doxygen to version 1.8.13 will require changes to apr-util-1_5 25674741 Updating doxygen to version 1.8.13 will require changes to apr-1_5 25674786 Updating doxygen to version 1.8.13 will require changes to cppunit 25674804 Updating doxygen to version 1.8.13 will require changes to dbus 25674827 Updating doxygen to version 1.8.13 will require changes to flac 25674874 Updating doxygen to version 1.8.13 will require changes to libexif 25674901 Updating doxygen to version 1.8.13 will require changes to libtheora 25674920 Updating doxygen to version 1.8.13 will require changes to libusb-1
components/apr-1_5/apr-15.p5m
components/apr-util-1_5/apr-util-15.p5m
components/cppunit/cppunit.p5m
components/desktop/dbus/dbus.p5m
components/desktop/flac/flac.p5m
components/desktop/libexif/libexif.p5m
components/doxygen/Makefile
components/doxygen/test/results-64.i386.master
components/doxygen/test/results-64.master
components/doxygen/test/results-64.sparc.master
components/libusb-1/libusb-1.p5m
--- a/components/apr-1_5/apr-15.p5m	Wed Mar 08 22:04:29 2017 -0800
+++ b/components/apr-1_5/apr-15.p5m	Fri Mar 17 10:32:56 2017 -0700
@@ -18,7 +18,7 @@
 #
 # CDDL HEADER END
 #
-# Copyright (c) 2014, 2016, Oracle and/or its affiliates. All rights reserved.
+# Copyright (c) 2014, 2017, Oracle and/or its affiliates. All rights reserved.
 #
 <transform file link hardlink path=usr/apr/1.5/.* -> \
     default facet.devel all>
@@ -178,8 +178,6 @@
 file path=usr/apr/1.5/manual/apr__version_8h_source.html
 file path=usr/apr/1.5/manual/apr__want_8h.html
 file path=usr/apr/1.5/manual/apr__want_8h_source.html
-file path=usr/apr/1.5/manual/arrowdown.png
-file path=usr/apr/1.5/manual/arrowright.png
 file path=usr/apr/1.5/manual/bc_s.png
 file path=usr/apr/1.5/manual/bdwn.png
 file path=usr/apr/1.5/manual/bug.html
@@ -271,6 +269,8 @@
 file path=usr/apr/1.5/manual/group__pollopts.html
 file path=usr/apr/1.5/manual/index.html
 file path=usr/apr/1.5/manual/jquery.js
+file path=usr/apr/1.5/manual/menu.js
+file path=usr/apr/1.5/manual/menudata.js
 file path=usr/apr/1.5/manual/modules.html
 file path=usr/apr/1.5/manual/nav_f.png
 file path=usr/apr/1.5/manual/nav_g.png
--- a/components/apr-util-1_5/apr-util-15.p5m	Wed Mar 08 22:04:29 2017 -0800
+++ b/components/apr-util-1_5/apr-util-15.p5m	Fri Mar 17 10:32:56 2017 -0700
@@ -18,7 +18,7 @@
 #
 # CDDL HEADER END
 #
-# Copyright (c) 2014, 2016, Oracle and/or its affiliates. All rights reserved.
+# Copyright (c) 2014, 2017, Oracle and/or its affiliates. All rights reserved.
 #
 <transform file link hardlink path=usr/apr-util/1.5/.* -> \
     default facet.devel all>
@@ -155,8 +155,6 @@
 file path=usr/apr-util/1.5/manual/apu__internal_8h_source.html
 file path=usr/apr-util/1.5/manual/apu__version_8h.html
 file path=usr/apr-util/1.5/manual/apu__version_8h_source.html
-file path=usr/apr-util/1.5/manual/arrowdown.png
-file path=usr/apr-util/1.5/manual/arrowright.png
 file path=usr/apr-util/1.5/manual/ascii_8h_source.html
 file path=usr/apr-util/1.5/manual/asciitab_8h_source.html
 file path=usr/apr-util/1.5/manual/bc_s.png
@@ -227,6 +225,8 @@
 file path=usr/apr-util/1.5/manual/jquery.js
 file path=usr/apr-util/1.5/manual/latin1tab_8h_source.html
 file path=usr/apr-util/1.5/manual/map__osd__ebcdic__df04__1_8h_source.html
+file path=usr/apr-util/1.5/manual/menu.js
+file path=usr/apr-util/1.5/manual/menudata.js
 file path=usr/apr-util/1.5/manual/modules.html
 file path=usr/apr-util/1.5/manual/namespace_apache.html
 file path=usr/apr-util/1.5/manual/namespaces.html
--- a/components/cppunit/cppunit.p5m	Wed Mar 08 22:04:29 2017 -0800
+++ b/components/cppunit/cppunit.p5m	Fri Mar 17 10:32:56 2017 -0700
@@ -17,7 +17,7 @@
 #
 # CDDL HEADER END
 #
-# Copyright (c) 2015, 2016, Oracle and/or its affiliates. All rights reserved.
+# Copyright (c) 2015, 2017, Oracle and/or its affiliates. All rights reserved.
 #
 
 <transform file path=usr.*/man/.+ -> default mangler.man.stability uncommitted>
@@ -889,8 +889,6 @@
 file path=usr/share/cppunit/html/_xml_outputter_hook_8h__incl.png
 file path=usr/share/cppunit/html/_xml_outputter_hook_8h_source.html
 file path=usr/share/cppunit/html/annotated.html
-file path=usr/share/cppunit/html/arrowdown.png
-file path=usr/share/cppunit/html/arrowright.png
 file path=usr/share/cppunit/html/bc_s.png
 file path=usr/share/cppunit/html/bdwn.png
 file path=usr/share/cppunit/html/class_additional_message-members.html
@@ -1610,6 +1608,8 @@
 file path=usr/share/cppunit/html/inherit_graph_9.png
 file path=usr/share/cppunit/html/inherits.html
 file path=usr/share/cppunit/html/jquery.js
+file path=usr/share/cppunit/html/menu.js
+file path=usr/share/cppunit/html/menudata.js
 file path=usr/share/cppunit/html/modules.html
 file path=usr/share/cppunit/html/money_example.html
 file path=usr/share/cppunit/html/msvc6_2testrunner_2_test_runner_8h.html
--- a/components/desktop/dbus/dbus.p5m	Wed Mar 08 22:04:29 2017 -0800
+++ b/components/desktop/dbus/dbus.p5m	Fri Mar 17 10:32:56 2017 -0700
@@ -20,7 +20,7 @@
 #
 
 #
-# Copyright (c) 2016, Oracle and/or its affiliates. All rights reserved.
+# Copyright (c) 2016, 2017, Oracle and/or its affiliates. All rights reserved.
 #
 <transform file path=usr.*/man/.+ -> default mangler.man.stability uncommitted>
 <transform file path=usr/share/doc/dbus/api/.* -> default facet.doc.html all>
@@ -61,8 +61,6 @@
 file path=usr/share/dbus-1/system.conf
 dir  path=usr/share/dbus-1/system.d
 file path=usr/share/doc/dbus/api/annotated.html
-file path=usr/share/doc/dbus/api/arrowdown.png
-file path=usr/share/doc/dbus/api/arrowright.png
 file path=usr/share/doc/dbus/api/bc_s.png
 file path=usr/share/doc/dbus/api/bdwn.png
 file path=usr/share/doc/dbus/api/classes.html
@@ -338,6 +336,8 @@
 file path=usr/share/doc/dbus/api/group__DBusWatchInternals.html
 file path=usr/share/doc/dbus/api/index.html
 file path=usr/share/doc/dbus/api/jquery.js
+file path=usr/share/doc/dbus/api/menu.js
+file path=usr/share/doc/dbus/api/menudata.js
 file path=usr/share/doc/dbus/api/modules.html
 file path=usr/share/doc/dbus/api/nav_f.png
 file path=usr/share/doc/dbus/api/nav_g.png
--- a/components/desktop/flac/flac.p5m	Wed Mar 08 22:04:29 2017 -0800
+++ b/components/desktop/flac/flac.p5m	Fri Mar 17 10:32:56 2017 -0700
@@ -20,7 +20,7 @@
 #
 
 #
-# Copyright (c) 2016, Oracle and/or its affiliates. All rights reserved.
+# Copyright (c) 2016, 2017, Oracle and/or its affiliates. All rights reserved.
 #
 
 <transform file path=usr.*/man/.+ -> default mangler.man.stability uncommitted>
@@ -77,8 +77,6 @@
 file path=usr/share/doc/flac-$(COMPONENT_VERSION)/html/api/_09_2metadata_8h_source.html
 file path=usr/share/doc/flac-$(COMPONENT_VERSION)/html/api/all_8h_source.html
 file path=usr/share/doc/flac-$(COMPONENT_VERSION)/html/api/annotated.html
-file path=usr/share/doc/flac-$(COMPONENT_VERSION)/html/api/arrowdown.png
-file path=usr/share/doc/flac-$(COMPONENT_VERSION)/html/api/arrowright.png
 file path=usr/share/doc/flac-$(COMPONENT_VERSION)/html/api/assert_8h_source.html
 file path=usr/share/doc/flac-$(COMPONENT_VERSION)/html/api/bc_s.png
 file path=usr/share/doc/flac-$(COMPONENT_VERSION)/html/api/bdwn.png
@@ -240,6 +238,8 @@
 file path=usr/share/doc/flac-$(COMPONENT_VERSION)/html/api/hierarchy.html
 file path=usr/share/doc/flac-$(COMPONENT_VERSION)/html/api/index.html
 file path=usr/share/doc/flac-$(COMPONENT_VERSION)/html/api/jquery.js
+file path=usr/share/doc/flac-$(COMPONENT_VERSION)/html/api/menu.js
+file path=usr/share/doc/flac-$(COMPONENT_VERSION)/html/api/menudata.js
 file path=usr/share/doc/flac-$(COMPONENT_VERSION)/html/api/metadata_8h.html
 file path=usr/share/doc/flac-$(COMPONENT_VERSION)/html/api/metadata_8h_source.html
 file path=usr/share/doc/flac-$(COMPONENT_VERSION)/html/api/modules.html
--- a/components/desktop/libexif/libexif.p5m	Wed Mar 08 22:04:29 2017 -0800
+++ b/components/desktop/libexif/libexif.p5m	Fri Mar 17 10:32:56 2017 -0700
@@ -20,7 +20,7 @@
 #
 
 #
-# Copyright (c) 2016, Oracle and/or its affiliates. All rights reserved.
+# Copyright (c) 2016, 2017, Oracle and/or its affiliates. All rights reserved.
 #
 
 <transform file path=usr.*/man/.+ -> \
@@ -67,14 +67,14 @@
 file path=usr/share/doc/libexif/libexif-api.html/__stdint_8h_source.html
 file path=usr/share/doc/libexif/libexif-api.html/annotated.html
 file path=usr/share/doc/libexif/libexif-api.html/annotated_dup.js
-file path=usr/share/doc/libexif/libexif-api.html/arrowdown.png
-file path=usr/share/doc/libexif/libexif-api.html/arrowright.png
 file path=usr/share/doc/libexif/libexif-api.html/bc_s.png
 file path=usr/share/doc/libexif/libexif-api.html/bdwn.png
 file path=usr/share/doc/libexif/libexif-api.html/bug.html
 file path=usr/share/doc/libexif/libexif-api.html/classes.html
 file path=usr/share/doc/libexif/libexif-api.html/closed.png
 file path=usr/share/doc/libexif/libexif-api.html/deprecated.html
+file path=usr/share/doc/libexif/libexif-api.html/dir_04d2bd150f7cc849eeec70b9b0fdccb1.html
+file path=usr/share/doc/libexif/libexif-api.html/dir_04d2bd150f7cc849eeec70b9b0fdccb1.js
 file path=usr/share/doc/libexif/libexif-api.html/doc.png
 file path=usr/share/doc/libexif/libexif-api.html/doxygen.css
 file path=usr/share/doc/libexif/libexif-api.html/doxygen.png
@@ -138,6 +138,8 @@
 file path=usr/share/doc/libexif/libexif-api.html/i18n_8h_source.html
 file path=usr/share/doc/libexif/libexif-api.html/index.html
 file path=usr/share/doc/libexif/libexif-api.html/jquery.js
+file path=usr/share/doc/libexif/libexif-api.html/menu.js
+file path=usr/share/doc/libexif/libexif-api.html/menudata.js
 file path=usr/share/doc/libexif/libexif-api.html/nav_f.png
 file path=usr/share/doc/libexif/libexif-api.html/nav_g.png
 file path=usr/share/doc/libexif/libexif-api.html/nav_h.png
--- a/components/doxygen/Makefile	Wed Mar 08 22:04:29 2017 -0800
+++ b/components/doxygen/Makefile	Fri Mar 17 10:32:56 2017 -0700
@@ -27,21 +27,21 @@
 include ../../make-rules/shared-macros.mk
 
 COMPONENT_NAME=		doxygen
-COMPONENT_VERSION=	1.8.11
+COMPONENT_VERSION=	1.8.13
 COMPONENT_PROJECT_URL=	http://www.stack.nl/~dimitri/doxygen/index.html
 COMPONENT_ARCHIVE=	$(COMPONENT_SRC).src.tar.gz
 COMPONENT_ARCHIVE_HASH=	\
-    sha256:65d08b46e48bd97186aef562dc366681045b119e00f83c5b61d05d37ea154049
+    sha256:af667887bd7a87dc0dbf9ac8d86c96b552dfb8ca9c790ed1cbffaa6131573f6b
 COMPONENT_ARCHIVE_URL=	http://ftp.stack.nl/pub/users/dimitri/$(COMPONENT_ARCHIVE)
 COMPONENT_ANITYA_ID=	457
 
 # Download the manual so that we don't have to keep updating it in the gate.
 COMPONENT_ARCHIVE_1 =	$(COMPONENT_NAME)_manual-$(COMPONENT_VERSION).pdf.zip
 COMPONENT_ARCHIVE_HASH_1 =	\
-    sha256:e7a6a0c853c715157070514bd29992315a7d14131dca5947110a18b0b3e8e61c
+    sha256:efc4937cf13b2e74f50ad8806d9b900f3c5e3f987ed503d763180053ee677ecd
 COMPONENT_ARCHIVE_URL_1 =	ftp://ftp.stack.nl/pub/users/dimitri/$(COMPONENT_ARCHIVE_1)
 
-TPNO=			27457
+TPNO=			34098
 
 BUILD_STYLE= cmake
 SYSTEM_TEST_TARGET= $(SYSTEM_TEST_64)
@@ -71,6 +71,10 @@
 COMPONENT_TEST_DIR =		$(BUILD_DIR_64)/testing
 COMPONENT_TEST_TARGETS =	tests
 
+# Results differ between x86 and SPARC.
+COMPONENT_TEST_MASTER = \
+	$(COMPONENT_TEST_RESULTS_DIR)/results-$(BITS).$(MACH).master
+
 # The additional doxygen specific set of transforms to be applied to the
 # test results to try to normalize them.
 COMPONENT_TEST_TRANSFORMS += \
--- /dev/null	Thu Jan 01 00:00:00 1970 +0000
+++ b/components/doxygen/test/results-64.i386.master	Fri Mar 17 10:32:56 2017 -0700
@@ -0,0 +1,93 @@
+[  6%] Built target doxycfg
+[  7%] Built target md5
+[ 25%] Built target qtools
+[ 30%] Built target vhdlparser
+[ 98%] Built target _doxygen
+[ 99%] Built target doxygen
+[100%] Running doxygen tests...
+1..65
+ok 1 - [022_dot.cpp]: test the \dot and \enddot commands
+ok 2 - [006_author.dox]: test the \author, \since, and \version command
+ok 3 - [030_htmlinclude.dox]: test the \htmlinclude command
+ok 4 - [028_formula.c]: test the \f$, \f[, \f], \f{, and \f} commands
+ok 5 - [059_command_catch.tcl]: tests processing of catch/eval, only references/referencedby relations are relevant
+ok 6 - [031_image.dox]: test the \image command
+ok 7 - [009_bug.cpp]: test the \bug, \deprecated, \todo, \test, and \xrefitem commands
+ok 8 - [046_related.cpp]: test the \related, \relatedalso, \see, and \sa commands
+ok 9 - [041_overload.cpp]: test the \overload command
+ok 10 - [016_copydoc.c]: test the \copydoc, \copybrief, \copydetails, and \details commands
+ok 11 - [064_castoperator.cpp]: test linking to the cast operator with and without const
+ok 12 - [057_caller_graphs.tcl]: test for completeness and correctness of references/referencedby relations 
+ok 13 - [052_tilde.dox]: test \~ command
+ok 14 - [053_tilde.dox]: test \~ command with non default OUTPUT_LANGUAGE
+ok 15 - [062_namespace_resolution.tcl]: tests correct namespace resolution, only references/referencedby relations are relevant
+ok 16 - [024_if.dox]: test the \if, \ifnot, \elsif, \else, and \endif commands
+ok 17 - [027_extends.c]: test the \extends, \implements, \memberof, \private, and \public commands
+ok 18 - [037_msc.cpp]: test the \msc and \endmsc commands
+ok 19 - [002_addindex.dox]: test \addindex command
+ok 20 - [023_e.dox]: test the \e, \em commands
+ok 21 - [005_attention.dox]: test \attention, \not, \remark, \warning, and \par commands
+ok 22 - [061_bug_705503.tcl]: test for bug 705503 - TCL: Documentation of oo::define is not working
+ok 23 - [051_escape.dox]: test various characters that should be escaped
+ok 24 - [020_only.dox]: test the \*only and \*endonly commands
+ok 25 - [029_hideinit.c]: test the \hideinitializer command
+ok 26 - [014_code.dox]: test the \code command
+ok 27 - [008_brief.c]: test \brief and \file command
+ok 28 - [033_internal.dox]: test the \internbibtex command failed: No such file or directory
+al and \endinternal commands (1)
+ok 29 - [039_name.cpp]: test the \name and \short commands
+ok 30 - [060_command_switch.tcl]: tests processing of switch, only references/referencedby relations are relevant
+ok 31 - [035_invariant.c]: test \invariant, \pre and \post commands
+ok 32 - [050_verbatim.dox]: test \verbatim and \verbinclude commands
+ok 33 - [025_example.cpp]: test the \example command
+not ok 34 - [012_cite.dox]: test the \cite command
+-------------------------------------
+Difference between generated output and reference:
+--- $(@D)/testing/test_output_012/indexpage.xml
++++ $(@D)/testing/012/indexpage.xml
[email protected]@ -4,7 +4,7 @@
+     <compoundname>index</compoundname>
+     <title>My Project</title>
+     <detaileddescription>
+-      <para>See knuth79 for more info. </para>
++      <para>See <ref refid="citelist_1CITEREF_knuth79" kindref="member">[1]</ref> for more info. </para>
+     </detaileddescription>
+   </compounddef>
+ </doxygen>
+
+-------------------------------------
+ok 35 - [036_link.c]: test \link command
+ok 36 - [063_bug_729092.tcl]: test for bug 729092 - TCL: Full documentation not shown for procs in namespaces.
+ok 37 - [010_c.dox]: test the \c and \p commands
+ok 38 - [034_internal.dox]: test the \internal and \endinternal commands (2)
+ok 39 - [019_defgroup.c]: test the \defgroup, \addtogroup, and \ingroup command.
+ok 40 - [017_copyright.dox]: test \copyright and \date commands
+ok 41 - [011_category.m]: test the \interface and \category command
+ok 42 - [044_section.h]: test the \(public|protected|private)section commands
+ok 43 - [015_cond.c]: test the \cond command
+ok 44 - [048_showinit.c]: test the \showinit command
+ok 45 - [055_markdown.md]: test markdown parsing
+ok 46 - [043_page.dox]: test \page, \subpage, \*section, \paragraph, and \ref commands
+ok 47 - [003_anchor.dox]: test \anchor command
+ok 48 - [004_arg.dox]: test \arg and \li commands
+ok 49 - [007_b.dox]: test the \b command
+ok 50 - [021_dontinclude.cpp]: test the \dontinclude, \skip, \until, \skipline, \line commands
+ok 51 - [049_snippet.cpp]: test the \snippet command
+ok 52 - [058_bracket_recursion.tcl]: tests processing of commands inside brackets [], only references/referencedby relations are relevant
+ok 53 - [042_package.java]: test the \package command
+ok 54 - [054_parblock.cpp]: test the \parblock command
+ok 55 - [056_latexinclude.dox]: test the \latexinclude command
+ok 56 - [045_refitem.dox]: test \refitem, \secreflist, \endsecreflist
+ok 57 - [065_tilde.dox]: test \~ command with non default OUTPUT_LANGUAGE which contains '-' letter
+ok 58 - [001_a.dox]: test the \a and \mainpage commands
+ok 59 - [032_include.cpp]: test the \include and \includelineno commands
+ok 60 - [038_n.dox]: test the \n command
+ok 61 - [026_exception.cpp]: test the \exception, \param, and \tparam commands
+ok 62 - [047_return.cpp]: test the \result, \return, and \returns commands
+ok 63 - [018_def.c]: test the \def, \var, \fn, and \typedef commands
+ok 64 - [013_class.h]: test the \class and \headerfile commands
+ok 65 - [040_namespace.cpp]: test the \namespace command
+1 out of 65 tests failed
+make[4]: *** [testing/CMakeFiles/tests.dir/build.make:58: testing/CMakeFiles/tests] Error 1
+make[3]: *** [CMakeFiles/Makefile2:496: testing/CMakeFiles/tests.dir/all] Error 2
+make[2]: *** [CMakeFiles/Makefile2:503: testing/CMakeFiles/tests.dir/rule] Error 2
--- a/components/doxygen/test/results-64.master	Wed Mar 08 22:04:29 2017 -0800
+++ /dev/null	Thu Jan 01 00:00:00 1970 +0000
@@ -1,97 +0,0 @@
-[ 69%] Built target _doxygen
-[ 71%] Built target md5
-[ 89%] Built target qtools
-[ 94%] Built target vhdlparser
-[ 98%] Built target doxycfg
-[ 99%] Built target doxygen
-[100%] Running doxygen tests...
-bibtex command failed: No such file or directory
-1..65
-ok 1 - [017_copyright.dox]: test \copyright and \date commands
-ok 2 - [038_n.dox]: test the \n command
-ok 3 - [001_a.dox]: test the \a and \mainpage commands
-ok 4 - [061_bug_705503.tcl]: test for bug 705503 - TCL: Documentation of oo::define is not working
-ok 5 - [006_author.dox]: test the \author, \since, and \version command
-ok 6 - [021_dontinclude.cpp]: test the \dontinclude, \skip, \until, \skipline, \line commands
-ok 7 - [018_def.c]: test the \def, \var, \fn, and \typedef commands
-ok 8 - [008_brief.c]: test \brief and \file command
-ok 9 - [039_name.cpp]: test the \name and \short commands
-ok 10 - [060_command_switch.tcl]: tests processing of switch, only references/referencedby relations are relevant
-ok 11 - [062_namespace_resolution.tcl]: tests correct namespace resolution, only references/referencedby relations are relevant
-ok 12 - [007_b.dox]: test the \b command
-ok 13 - [054_parblock.cpp]: test the \parblock command
-ok 14 - [042_package.java]: test the \package command
-ok 15 - [037_msc.cpp]: test the \msc and \endmsc commands
-ok 16 - [065_tilde.dox]: test \~ command with non default OUTPUT_LANGUAGE which contains '-' letter
-not ok 17 - [012_cite.dox]: test the \cite command
--------------------------------------
-Difference between generated output and reference:
---- $(@D)/testing/test_output_012/indexpage.xml
-+++ $(@D)/testing/012/indexpage.xml
[email protected]@ -4,7 +4,7 @@
-     <compoundname>index</compoundname>
-     <title>My Project</title>
-     <detaileddescription>
--      <para>See knuth79 for more info. </para>
-+      <para>See <ref refid="citelist_1CITEREF_knuth79" kindref="member">[1]</ref> for more info. </para>
-     </detaileddescription>
-   </compounddef>
- </doxygen>
-
--------------------------------------
-ok 18 - [040_namespace.cpp]: test the \namespace command
-ok 19 - [010_c.dox]: test the \c and \p commands
-ok 20 - [056_latexinclude.dox]: test the \latexinclude command
-ok 21 - [034_internal.dox]: test the \internal and \endinternal commands (2)
-ok 22 - [044_section.h]: test the \(public|protected|private)section commands
-ok 23 - [009_bug.cpp]: test the \bug, \deprecated, \todo, \test, and \xrefitem commands
-ok 24 - [026_exception.cpp]: test the \exception, \param, and \tparam commands
-ok 25 - [051_escape.dox]: test various characters that should be escaped
-ok 26 - [022_dot.cpp]: test the \dot and \enddot commands
-ok 27 - [050_verbatim.dox]: test \verbatim and \verbinclude commands
-ok 28 - [043_page.dox]: test \page, \subpage, \*section, \paragraph, and \ref commands
-ok 29 - [029_hideinit.c]: test the \hideinitializer command
-ok 30 - [033_internal.dox]: test the \internal and \endinternal commands (1)
-ok 31 - [024_if.dox]: test the \if, \ifnot, \elsif, \else, and \endif commands
-ok 32 - [046_related.cpp]: test the \related, \relatedalso, \see, and \sa commands
-ok 33 - [055_markdown.md]: test markdown parsing
-ok 34 - [023_e.dox]: test the \e, \em commands
-ok 35 - [015_cond.c]: test the \cond command
-ok 36 - [045_refitem.dox]: test \refitem, \secreflist, \endsecreflist
-ok 37 - [013_class.h]: test the \class and \headerfile commands
-ok 38 - [049_snippet.cpp]: test the \snippet command
-ok 39 - [032_include.cpp]: test the \include and \includelineno commands
-ok 40 - [011_category.m]: test the \interface and \category command
-ok 41 - [052_tilde.dox]: test \~ command
-ok 42 - [004_arg.dox]: test \arg and \li commands
-ok 43 - [019_defgroup.c]: test the \defgroup, \addtogroup, and \ingroup command.
-ok 44 - [036_link.c]: test \link command
-ok 45 - [002_addindex.dox]: test \addindex command
-ok 46 - [053_tilde.dox]: test \~ command with non default OUTPUT_LANGUAGE
-ok 47 - [048_showinit.c]: test the \showinit command
-ok 48 - [027_extends.c]: test the \extends, \implements, \memberof, \private, and \public commands
-ok 49 - [057_caller_graphs.tcl]: test for completeness and correctness of references/referencedby relations 
-ok 50 - [064_castoperator.cpp]: test linking to the cast operator with and without const
-ok 51 - [035_invariant.c]: test \invariant, \pre and \post commands
-ok 52 - [031_image.dox]: test the \image command
-ok 53 - [041_overload.cpp]: test the \overload command
-ok 54 - [028_formula.c]: test the \f$, \f[, \f], \f{, and \f} commands
-ok 55 - [030_htmlinclude.dox]: test the \htmlinclude command
-ok 56 - [005_attention.dox]: test \attention, \not, \remark, \warning, and \par commands
-ok 57 - [003_anchor.dox]: test \anchor command
-ok 58 - [025_example.cpp]: test the \example command
-ok 59 - [058_bracket_recursion.tcl]: tests processing of commands inside brackets [], only references/referencedby relations are relevant
-ok 60 - [059_command_catch.tcl]: tests processing of catch/eval, only references/referencedby relations are relevant
-ok 61 - [014_code.dox]: test the \code command
-ok 62 - [016_copydoc.c]: test the \copydoc, \copybrief, \copydetails, and \details commands
-ok 63 - [020_only.dox]: test the \*only and \*endonly commands
-ok 64 - [063_bug_729092.tcl]: test for bug 729092 - TCL: Full documentation not shown for procs in namespaces.
-ok 65 - [047_return.cpp]: test the \result, \return, and \returns commands
-1 out of 65 tests failed
-testing/CMakeFiles/tests.dir/build.make:57: recipe for target 'testing/CMakeFiles/tests' failed
-make[4]: *** [testing/CMakeFiles/tests] Error 1
-CMakeFiles/Makefile2:495: recipe for target 'testing/CMakeFiles/tests.dir/all' failed
-make[3]: *** [testing/CMakeFiles/tests.dir/all] Error 2
-CMakeFiles/Makefile2:502: recipe for target 'testing/CMakeFiles/tests.dir/rule' failed
-make[2]: *** [testing/CMakeFiles/tests.dir/rule] Error 2
-Makefile:192: recipe for target 'testing/CMakeFiles/tests.dir/rule' failed
--- /dev/null	Thu Jan 01 00:00:00 1970 +0000
+++ b/components/doxygen/test/results-64.sparc.master	Fri Mar 17 10:32:56 2017 -0700
@@ -0,0 +1,93 @@
+[  6%] Built target doxycfg
+[  7%] Built target md5
+[ 25%] Built target qtools
+[ 30%] Built target vhdlparser
+[ 98%] Built target _doxygen
+[ 99%] Built target doxygen
+[100%] Running doxygen tests...
+1..65
+ok 1 - [031_image.dox]: test the \image command
+ok 2 - [045_refitem.dox]: test \refitem, \secreflist, \endsecreflist
+ok 3 - [028_formula.c]: test the \f$, \f[, \f], \f{, and \f} commands
+ok 4 - [007_b.dox]: test the \b command
+ok 5 - [049_snippet.cpp]: test the \snippet command
+ok 6 - [041_overload.cpp]: test the \overload command
+ok 7 - [019_defgroup.c]: test the \defgroup, \addtogroup, and \ingroup command.
+ok 8 - [022_dot.cpp]: test the \dot and \enddot commands
+ok 9 - [016_copydoc.c]: test the \copydoc, \copybrief, \copydetails, and \details commands
+ok 10 - [011_category.m]: test the \interface and \category command
+ok 11 - [048_showinit.c]: test the \showinit command
+ok 12 - [017_copyright.dox]: test \copyright and \date commands
+ok 13 - [055_markdown.md]: test markdown parsing
+ok 14 - [038_n.dox]: test the \n command
+ok 15 - [009_bug.cpp]: test the \bug, \deprecated, \todo, \test, and \xrefitem commands
+ok 16 - [001_a.dox]: test the \a and \mainpage commands
+ok 17 - [032_include.cpp]: test the \include and \includelineno commands
+ok 18 - [059_command_catch.tcl]: tests processing of catch/eval, only references/referencedby relations are relevant
+ok 19 - [018_def.c]: test the \def, \var, \fn, and \typedef commands
+ok 20 - [061_bug_705503.tcl]: test for bug 705503 - TCL: Documentation of oo::define is not working
+ok 21 - [021_dontinclude.cpp]: test the \dontinclude, \skip, \until, \skipline, \line commands
+ok 22 - [037_msc.cpp]: test the \msc and \endmsc commands
+ok 23 - [026_exception.cpp]: test the \exception, \param, and \tparam commands
+ok 24 - [036_link.c]: test \link command
+ok 25 - [025_example.cpp]: test the \example command
+ok 26 - [040_namespace.cpp]: test the \namespace command
+ok 27 - [047_return.cpp]: test the \result, \return, and \returns commands
+ok 28 - [035_invariant.c]: test \invariant, \pre and \post commands
+ok 29 - [057_caller_graphs.tcl]: test for completeness and correctness of references/referencedby relations 
+ok 30 - [053_tilde.dox]: test \~ command with non default OUTPUT_LANbibtex command failed: No such file or directory
+GUAGE
+ok 31 - [003_anchor.dox]: test \anchor command
+ok 32 - [052_tilde.dox]: test \~ command
+ok 33 - [008_brief.c]: test \brief and \file command
+ok 34 - [015_cond.c]: test the \cond command
+ok 35 - [010_c.dox]: test the \c and \p commands
+ok 36 - [064_castoperator.cpp]: test linking to the cast operator with and without const
+ok 37 - [014_code.dox]: test the \code command
+ok 38 - [002_addindex.dox]: test \addindex command
+ok 39 - [020_only.dox]: test the \*only and \*endonly commands
+ok 40 - [027_extends.c]: test the \extends, \implements, \memberof, \private, and \public commands
+ok 41 - [039_name.cpp]: test the \name and \short commands
+ok 42 - [030_htmlinclude.dox]: test the \htmlinclude command
+ok 43 - [034_internal.dox]: test the \internal and \endinternal commands (2)
+not ok 44 - [012_cite.dox]: test the \cite command
+-------------------------------------
+Difference between generated output and reference:
+--- /builds/richb/update-doxygen/components/doxygen/build/sparcv9/testing/test_output_012/indexpage.xml
++++ /builds/richb/update-doxygen/components/doxygen/build/sparcv9/testing/012/indexpage.xml
[email protected]@ -4,7 +4,7 @@
+     <compoundname>index</compoundname>
+     <title>My Project</title>
+     <detaileddescription>
+-      <para>See knuth79 for more info. </para>
++      <para>See <ref refid="citelist_1CITEREF_knuth79" kindref="member">[1]</ref> for more info. </para>
+     </detaileddescription>
+   </compounddef>
+ </doxygen>
+
+-------------------------------------
+ok 45 - [056_latexinclude.dox]: test the \latexinclude command
+ok 46 - [044_section.h]: test the \(public|protected|private)section commands
+ok 47 - [058_bracket_recursion.tcl]: tests processing of commands inside brackets [], only references/referencedby relations are relevant
+ok 48 - [024_if.dox]: test the \if, \ifnot, \elsif, \else, and \endif commands
+ok 49 - [006_author.dox]: test the \author, \since, and \version command
+ok 50 - [033_internal.dox]: test the \internal and \endinternal commands (1)
+ok 51 - [023_e.dox]: test the \e, \em commands
+ok 52 - [050_verbatim.dox]: test \verbatim and \verbinclude commands
+ok 53 - [063_bug_729092.tcl]: test for bug 729092 - TCL: Full documentation not shown for procs in namespaces.
+ok 54 - [005_attention.dox]: test \attention, \not, \remark, \warning, and \par commands
+ok 55 - [043_page.dox]: test \page, \subpage, \*section, \paragraph, and \ref commands
+ok 56 - [060_command_switch.tcl]: tests processing of switch, only references/referencedby relations are relevant
+ok 57 - [004_arg.dox]: test \arg and \li commands
+ok 58 - [051_escape.dox]: test various characters that should be escaped
+ok 59 - [029_hideinit.c]: test the \hideinitializer command
+ok 60 - [062_namespace_resolution.tcl]: tests correct namespace resolution, only references/referencedby relations are relevant
+ok 61 - [046_related.cpp]: test the \related, \relatedalso, \see, and \sa commands
+ok 62 - [013_class.h]: test the \class and \headerfile commands
+ok 63 - [054_parblock.cpp]: test the \parblock command
+ok 64 - [042_package.java]: test the \package command
+ok 65 - [065_tilde.dox]: test \~ command with non default OUTPUT_LANGUAGE which contains '-' letter
+1 out of 65 tests failed
+make[4]: *** [testing/CMakeFiles/tests.dir/build.make:58: testing/CMakeFiles/tests] Error 1
+make[3]: *** [CMakeFiles/Makefile2:496: testing/CMakeFiles/tests.dir/all] Error 2
+make[2]: *** [CMakeFiles/Makefile2:503: testing/CMakeFiles/tests.dir/rule] Error 2
--- a/components/libusb-1/libusb-1.p5m	Wed Mar 08 22:04:29 2017 -0800
+++ b/components/libusb-1/libusb-1.p5m	Fri Mar 17 10:32:56 2017 -0700
@@ -20,7 +20,7 @@
 #
 
 #
-# Copyright (c) 2016, Oracle and/or its affiliates. All rights reserved.
+# Copyright (c) 2016, 2017, Oracle and/or its affiliates. All rights reserved.
 #
 
 <transform file path=usr.*/man/.+ -> default mangler.man.stability "Pass-through Volatile" >
@@ -48,8 +48,6 @@
 file path=usr/lib/pkgconfig/libusb-1.0.pc
 file path=usr/share/doc/libusb-1.0/html/annotated.html
 file path=usr/share/doc/libusb-1.0/html/api.html
-file path=usr/share/doc/libusb-1.0/html/arrowdown.png
-file path=usr/share/doc/libusb-1.0/html/arrowright.png
 file path=usr/share/doc/libusb-1.0/html/bc_s.png
 file path=usr/share/doc/libusb-1.0/html/bdwn.png
 file path=usr/share/doc/libusb-1.0/html/caveats.html
@@ -80,6 +78,8 @@
 file path=usr/share/doc/libusb-1.0/html/io.html
 file path=usr/share/doc/libusb-1.0/html/jquery.js
 file path=usr/share/doc/libusb-1.0/html/libusb_8h_source.html
+file path=usr/share/doc/libusb-1.0/html/menu.js
+file path=usr/share/doc/libusb-1.0/html/menudata.js
 file path=usr/share/doc/libusb-1.0/html/modules.html
 file path=usr/share/doc/libusb-1.0/html/mtasync.html
 file path=usr/share/doc/libusb-1.0/html/nav_f.png
@@ -104,6 +104,7 @@
 file path=usr/share/doc/libusb-1.0/html/structlibusb__ss__usb__device__capability__descriptor.html
 file path=usr/share/doc/libusb-1.0/html/structlibusb__transfer.html
 file path=usr/share/doc/libusb-1.0/html/structlibusb__usb__2__0__extension__descriptor.html
+file path=usr/share/doc/libusb-1.0/html/structlibusb__version.html
 file path=usr/share/doc/libusb-1.0/html/sync_off.png
 file path=usr/share/doc/libusb-1.0/html/sync_on.png
 file path=usr/share/doc/libusb-1.0/html/tab_a.png